BDBM106940 US8592468, EbSe7
SMILES: Clc1ccc(cc1)-n1[se]c2ccccc2c1=O
InChI Key: InChIKey=KIFWXWMOJVGFLN-UHFFFAOYSA-N
Data: 1 KI  1 IC50
Activity Spreadsheet -- Enzyme Inhibition Constant Data from BindingDB
Found 1 hit for monomerid = 106940
Trg + Lig
Ki
nM
ΔG°
kcal/mole
IC50
nM
Kd
nM
EC50/IC50
nM
koff
s-1
kon
M-1s-1
pHTemp
°C
Thioredoxin reductase (TrxR)
(Escherichia coli (strain K12))
BDBM106940
(US8592468, EbSe7)
Show SMILES Clc1ccc(cc1)-n1[se]c2ccccc2c1=O
Show InChI InChI=1S/C13H8ClNOSe/c14-9-5-7-10(8-6-9)15-13(16)11-3-1-2-4-12(11)17-15/h1-8H
US Patent
550n/a 7.00E+3n/an/an/an/an/an/a
Thioredoxin Systems AB
US Patent
Assay Description
All the benzisoselenazol-3(2H)-one and bisbenzisoselenazol-3(2H)-one derivatives were tested as potential E. coli TrxR inhibitors by standard DTNB ...
US Patent US8592468 (2013)
BindingDB Entry DOI: 10.7270/Q29P3081