BDBM106942 US8592468, EbSe9
SMILES: O=COc1ccccc1-n1[se]c2ccccc2c1=O
InChI Key: InChIKey=RDQUTXFRRFEWDK-UHFFFAOYSA-N
Data: 1 KI  1 IC50
Activity Spreadsheet -- Enzyme Inhibition Constant Data from BindingDB
Found 1 hit for monomerid = 106942
Trg + Lig
Ki
nM
ΔG°
kcal/mole
IC50
nM
Kd
nM
EC50/IC50
nM
koff
s-1
kon
M-1s-1
pHTemp
°C
Thioredoxin reductase (TrxR)
(Escherichia coli (strain K12))
BDBM106942
(US8592468, EbSe9)
Show SMILES O=COc1ccccc1-n1[se]c2ccccc2c1=O
Show InChI InChI=1S/C14H9NO3Se/c16-9-18-12-7-3-2-6-11(12)15-14(17)10-5-1-4-8-13(10)19-15/h1-9H
US Patent
1.20E+3n/a 7.50E+3n/an/an/an/an/an/a
Thioredoxin Systems AB
US Patent
Assay Description
All the benzisoselenazol-3(2H)-one and bisbenzisoselenazol-3(2H)-one derivatives were tested as potential E. coli TrxR inhibitors by standard DTNB ...
US Patent US8592468 (2013)
BindingDB Entry DOI: 10.7270/Q29P3081