BDBM107176 US8592426, 25
SMILES: Cc1nc(no1)-c1c(F)cc(Cl)cc1-c1ccc2[C@H](CCc2c1)NC(=O)C1(CC1)NC(=O)c1cncnc1
InChI Key: InChIKey=PAUIXIOLYSEIEG-QFIPXVFZSA-N
Data: 1 KI  1 IC50
Activity Spreadsheet -- Enzyme Inhibition Constant Data from BindingDB
Found 2 hits for monomerid = 107176
Trg + Lig
Ki
nM
ΔG°
kcal/mole
IC50
nM
Kd
nM
EC50/IC50
nM
koff
s-1
kon
M-1s-1
pHTemp
°C
Bradykinin-1 Receptor
(Homo sapiens (Human))
BDBM107176
(US8592426, 25)
Show SMILES Cc1nc(no1)-c1c(F)cc(Cl)cc1-c1ccc2[C@H](CCc2c1)NC(=O)C1(CC1)NC(=O)c1cncnc1 |r|
Show InChI InChI=1S/C27H22ClFN6O3/c1-14-32-24(35-38-14)23-20(9-18(28)10-21(23)29)16-2-4-19-15(8-16)3-5-22(19)33-26(37)27(6-7-27)34-25(36)17-11-30-13-31-12-17/h2,4,8-13,22H,3,5-7H2,1H3,(H,33,37)(H,34,36)/t22-/m0/s1
Reactome pathway
US Patent
3.10n/an/an/an/an/an/an/an/a
Hoffmann—La Roche Inc.
US Patent
Assay Description
Binding assay using Bradykinin-1 receptor.
US Patent US8592426 (2013)
BindingDB Entry DOI: 10.7270/Q2WH2NN0
Bradykinin-1 Receptor
(Homo sapiens (Human))
BDBM107176
(US8592426, 25)
Show SMILES Cc1nc(no1)-c1c(F)cc(Cl)cc1-c1ccc2[C@H](CCc2c1)NC(=O)C1(CC1)NC(=O)c1cncnc1 |r|
Show InChI InChI=1S/C27H22ClFN6O3/c1-14-32-24(35-38-14)23-20(9-18(28)10-21(23)29)16-2-4-19-15(8-16)3-5-22(19)33-26(37)27(6-7-27)34-25(36)17-11-30-13-31-12-17/h2,4,8-13,22H,3,5-7H2,1H3,(H,33,37)(H,34,36)/t22-/m0/s1
Reactome pathway
US Patent
n/an/a 0.100n/an/an/an/an/an/a
Hoffmann—La Roche Inc.
US Patent
Assay Description
Calcium mobilization assay using Bradykinin-1 receptor.
US Patent US8592426 (2013)
BindingDB Entry DOI: 10.7270/Q2WH2NN0