BDBM107187 US8592426, 36
SMILES: Cc1nc(no1)-c1c(F)cc(Cl)cc1-c1cnc2C(CCc2c1)NC(=O)C1(CC1)NC(=O)OC(C)(C)C
InChI Key: InChIKey=BLGPUKWHJXZTPQ-UHFFFAOYSA-N
Data: 1 KI  1 IC50
Activity Spreadsheet -- Enzyme Inhibition Constant Data from BindingDB
Found 2 hits for monomerid = 107187
Trg + Lig
Ki
nM
ΔG°
kcal/mole
IC50
nM
Kd
nM
EC50/IC50
nM
koff
s-1
kon
M-1s-1
pHTemp
°C
Kininogen-1
(Homo sapiens (Human))
BDBM107187
(US8592426, 36)
Show SMILES Cc1nc(no1)-c1c(F)cc(Cl)cc1-c1cnc2C(CCc2c1)NC(=O)C1(CC1)NC(=O)OC(C)(C)C
Show InChI InChI=1S/C26H27ClFN5O4/c1-13-30-22(33-37-13)20-17(10-16(27)11-18(20)28)15-9-14-5-6-19(21(14)29-12-15)31-23(34)26(7-8-26)32-24(35)36-25(2,3)4/h9-12,19H,5-8H2,1-4H3,(H,31,34)(H,32,35)
Reactome pathway
US Patent
361n/an/an/an/an/an/an/an/a
Hoffmann—La Roche Inc.
US Patent
Assay Description
Binding assay using Bradykinin-1 receptor.
US Patent US8592426 (2013)
BindingDB Entry DOI: 10.7270/Q2WH2NN0
Kininogen-1
(Homo sapiens (Human))
BDBM107187
(US8592426, 36)
Show SMILES Cc1nc(no1)-c1c(F)cc(Cl)cc1-c1cnc2C(CCc2c1)NC(=O)C1(CC1)NC(=O)OC(C)(C)C
Show InChI InChI=1S/C26H27ClFN5O4/c1-13-30-22(33-37-13)20-17(10-16(27)11-18(20)28)15-9-14-5-6-19(21(14)29-12-15)31-23(34)26(7-8-26)32-24(35)36-25(2,3)4/h9-12,19H,5-8H2,1-4H3,(H,31,34)(H,32,35)
Reactome pathway
US Patent
n/an/a 3.60n/an/an/an/an/an/a
Hoffmann—La Roche Inc.
US Patent
Assay Description
Calcium mobilization assay using Bradykinin-1 receptor.
US Patent US8592426 (2013)
BindingDB Entry DOI: 10.7270/Q2WH2NN0