BDBM107209 US8592426, 59
SMILES: COc1cc(on1)C(=O)NC1(CC1)C(=O)NC1CCc2cc(cnc12)-c1cc(Cl)cc(F)c1-c1nnn(C)n1
InChI Key: InChIKey=MIJKUFVQFDMZAW-UHFFFAOYSA-N
Data: 1 KI  1 IC50
Activity Spreadsheet -- Enzyme Inhibition Constant Data from BindingDB
Found 2 hits for monomerid = 107209
Trg + Lig
Ki
nM
ΔG°
kcal/mole
IC50
nM
Kd
nM
EC50/IC50
nM
koff
s-1
kon
M-1s-1
pHTemp
°C
Kininogen-1
(Homo sapiens (Human))
BDBM107209
(US8592426, 59)
Show SMILES COc1cc(on1)C(=O)NC1(CC1)C(=O)NC1CCc2cc(cnc12)-c1cc(Cl)cc(F)c1-c1nnn(C)n1
Show InChI InChI=1S/C25H22ClFN8O4/c1-35-32-22(31-34-35)20-15(8-14(26)9-16(20)27)13-7-12-3-4-17(21(12)28-11-13)29-24(37)25(5-6-25)30-23(36)18-10-19(38-2)33-39-18/h7-11,17H,3-6H2,1-2H3,(H,29,37)(H,30,36)
Reactome pathway
US Patent
3.5n/an/an/an/an/an/an/an/a
Hoffmann—La Roche Inc.
US Patent
Assay Description
Binding assay using Bradykinin-1 receptor.
US Patent US8592426 (2013)
BindingDB Entry DOI: 10.7270/Q2WH2NN0
Kininogen-1
(Homo sapiens (Human))
BDBM107209
(US8592426, 59)
Show SMILES COc1cc(on1)C(=O)NC1(CC1)C(=O)NC1CCc2cc(cnc12)-c1cc(Cl)cc(F)c1-c1nnn(C)n1
Show InChI InChI=1S/C25H22ClFN8O4/c1-35-32-22(31-34-35)20-15(8-14(26)9-16(20)27)13-7-12-3-4-17(21(12)28-11-13)29-24(37)25(5-6-25)30-23(36)18-10-19(38-2)33-39-18/h7-11,17H,3-6H2,1-2H3,(H,29,37)(H,30,36)
Reactome pathway
US Patent
n/an/a 0.300n/an/an/an/an/an/a
Hoffmann—La Roche Inc.
US Patent
Assay Description
Calcium mobilization assay using Bradykinin-1 receptor.
US Patent US8592426 (2013)
BindingDB Entry DOI: 10.7270/Q2WH2NN0