BDBM107312 US8592379, 24a/24b::US8592379, 35
SMILES: CNC[C@H](O)CC(CC(C)C)C(C)=O
InChI Key: InChIKey=DXAGOQFKSWOAON-RRKGBCIJSA-N
Data: 2 IC50
Activity Spreadsheet -- Enzyme Inhibition Constant Data from BindingDB
Found 2 hits for monomerid = 107312
Trg + Lig
Ki
nM
ΔG°
kcal/mole
IC50
nM
Kd
nM
EC50/IC50
nM
koff
s-1
kon
M-1s-1
pHTemp
°C
G-protein Coupled Receptor 54
(Homo sapiens (Human))
BDBM107312
(US8592379, 24a/24b | US8592379, 35)
Show SMILES CNC[C@H](O)CC(CC(C)C)C(C)=O |r|
Show InChI InChI=1S/C11H23NO2/c1-8(2)5-10(9(3)13)6-11(14)7-12-4/h8,10-12,14H,5-7H2,1-4H3/t10?,11-/m1/s1
Reactome pathway
US Patent
n/an/a 5.70n/an/an/an/an/an/a
Kyoto University; Takeda Pharmaceutical Company Limited
US Patent
Assay Description
Binding inhibition assay using human GPR54.
US Patent US8592379 (2013)
BindingDB Entry DOI: 10.7270/Q2N0156N
G-protein Coupled Receptor 54
(Homo sapiens (Human))
BDBM107312
(US8592379, 24a/24b | US8592379, 35)
Show SMILES CNC[C@H](O)CC(CC(C)C)C(C)=O |r|
Show InChI InChI=1S/C11H23NO2/c1-8(2)5-10(9(3)13)6-11(14)7-12-4/h8,10-12,14H,5-7H2,1-4H3/t10?,11-/m1/s1
Reactome pathway
US Patent
n/an/a 380n/an/an/an/an/an/a
Kyoto University; Takeda Pharmaceutical Company Limited
US Patent
Assay Description
Binding inhibition assay using human GPR54.
US Patent US8592379 (2013)
BindingDB Entry DOI: 10.7270/Q2N0156N