BDBM107320 US8592431, 5
SMILES: CCCc1c(Cc2ccc(cc2)-c2ccccc2-c2nc(=O)o[nH]2)c(=O)n(Cc2ccc(F)cc2)c2nc(C)nn12
InChI Key: InChIKey=BKKCJJIPELGQME-UHFFFAOYSA-N
Data: 1 IC50
Activity Spreadsheet -- Enzyme Inhibition Constant Data from BindingDB
Found 1 hit for monomerid = 107320
Trg + Lig
Ki
nM
ΔG°
kcal/mole
IC50
nM
Kd
nM
EC50/IC50
nM
koff
s-1
kon
M-1s-1
pHTemp
°C
Acetyl-coenzyme A transporter 1 (AT1)
(Homo sapiens (Human))
BDBM107320
(US8592431, 5)
Show SMILES CCCc1c(Cc2ccc(cc2)-c2ccccc2-c2nc(=O)o[nH]2)c(=O)n(Cc2ccc(F)cc2)c2nc(C)nn12
Show InChI InChI=1S/C31H27FN6O3/c1-3-6-27-26(29(39)37(30-33-19(2)35-38(27)30)18-21-11-15-23(32)16-12-21)17-20-9-13-22(14-10-20)24-7-4-5-8-25(24)28-34-31(40)41-36-28/h4-5,7-16H,3,6,17-18H2,1-2H3,(H,34,36,40)
Reactome pathway
US Patent
n/an/a 1.70n/an/an/an/a7.4n/a
Takeda Pharmaceutical Company Limited
US Patent
Assay Description
The binding assay was performed using 22.5 pM [125I]-angiotensin II [manufactured by PerkinElmer, USA] (9 μg) in the presence of AT1 membrane an...
US Patent US8592431 (2013)
BindingDB Entry DOI: 10.7270/Q2H70DGX