BDBM107330 US8592431, 69
SMILES: CCCc1c(Cc2ccc(cc2)-c2ccccc2-c2nc(=O)o[nH]2)c(=O)n(CC2(C)CC2)c2nc(C)nn12
InChI Key: InChIKey=JIDXEERWAWKOAA-UHFFFAOYSA-N
Data: 1 IC50
Activity Spreadsheet -- Enzyme Inhibition Constant Data from BindingDB
Found 1 hit for monomerid = 107330
Trg + Lig
Ki
nM
ΔG°
kcal/mole
IC50
nM
Kd
nM
EC50/IC50
nM
koff
s-1
kon
M-1s-1
pHTemp
°C
Acetyl-coenzyme A transporter 1 (AT1)
(Homo sapiens (Human))
BDBM107330
(US8592431, 69)
Show SMILES CCCc1c(Cc2ccc(cc2)-c2ccccc2-c2nc(=O)o[nH]2)c(=O)n(CC2(C)CC2)c2nc(C)nn12
Show InChI InChI=1S/C29H30N6O3/c1-4-7-24-23(26(36)34(17-29(3)14-15-29)27-30-18(2)32-35(24)27)16-19-10-12-20(13-11-19)21-8-5-6-9-22(21)25-31-28(37)38-33-25/h5-6,8-13H,4,7,14-17H2,1-3H3,(H,31,33,37)
Reactome pathway
US Patent
n/an/a 1.40n/an/an/an/a7.4n/a
Takeda Pharmaceutical Company Limited
US Patent
Assay Description
The binding assay was performed using 22.5 pM [125I]-angiotensin II [manufactured by PerkinElmer, USA] (9 μg) in the presence of AT1 membrane an...
US Patent US8592431 (2013)
BindingDB Entry DOI: 10.7270/Q2H70DGX