null
SMILES: CCCc1c(Cc2ccc(cc2)-c2ccccc2-c2nc(=O)o[nH]2)c(=O)n([C@H]2CC[C@@H](CC2)OCC(C)(O)CF)c2nc(C)nn12
InChI Key: InChIKey=NFMJINMDTGNYGI-QQGDSDHISA-N
Activity Spreadsheet -- Enzyme Inhibition Constant Data from BindingDB
Found 1 hit for monomerid = 107435
Trg + Lig
Ki
nM
ΔG°
kcal/mole
IC50
nM
Kd
nM
EC50/IC50
nM
koff
s-1
kon
M-1s-1
pHTemp
°C
Acetyl-coenzyme A transporter 1
(Homo sapiens (Human))
BDBM107435
(US8592431, 354)
Show SMILES CCCc1c(Cc2ccc(cc2)-c2ccccc2-c2nc(=O)o[nH]2)c(=O)n([C@H]2CC[C@@H](CC2)OCC(C)(O)CF)c2nc(C)nn12 |r,wU:27.29,wD:30.36,(-7.16,1.78,;-5.82,2.55,;-4.49,1.78,;-3.16,2.55,;-1.82,1.78,;-1.82,.24,;-3.16,-.53,;-3.16,-2.07,;-4.49,-2.84,;-5.82,-2.07,;-5.82,-.53,;-4.49,.24,;-7.16,-2.84,;-8.49,-2.07,;-9.82,-2.84,;-9.82,-4.38,;-8.49,-5.15,;-7.16,-4.38,;-5.82,-5.15,;-5.82,-6.69,;-4.36,-7.17,;-3.59,-8.5,;-3.45,-5.92,;-4.36,-4.68,;-.49,2.55,;.85,1.78,;-.49,4.09,;.85,4.86,;.85,6.4,;2.18,7.17,;3.51,6.4,;3.51,4.86,;2.18,4.09,;4.85,7.17,;6.18,6.4,;7.51,7.17,;6.74,8.5,;8.85,6.4,;8.28,8.5,;9.82,8.5,;-1.82,4.86,;-2.14,6.36,;-3.67,6.53,;-4.44,7.86,;-4.3,5.12,;-3.16,4.09,)|
Show InChI InChI=1S/C34H39FN6O5/c1-4-7-29-28(18-22-10-12-23(13-11-22)26-8-5-6-9-27(26)30-37-33(43)46-39-30)31(42)40(32-36-21(2)38-41(29)32)24-14-16-25(17-15-24)45-20-34(3,44)19-35/h5-6,8-13,24-25,44H,4,7,14-20H2,1-3H3,(H,37,39,43)/t24-,25-,34?
Reactome pathway
US Patent
n/an/a 1.20n/an/an/an/a7.4n/a
Takeda Pharmaceutical Company Limited
US Patent
Assay Description
The binding assay was performed using 22.5 pM [125I]-angiotensin II [manufactured by PerkinElmer, USA] (9 μg) in the presence of AT1 membrane an...
US Patent US8592431 (2013)
BindingDB Entry DOI: 10.7270/Q2H70DGX