null
SMILES: O=C(c1nc2nc(ccc2[nH]1)N1CCCNCC1)c1ccnc(c1)-c1cncc2ccccc12
InChI Key: InChIKey=ZORNFEJUOXUUQB-UHFFFAOYSA-N
Activity Spreadsheet -- Enzyme Inhibition Constant Data from BindingDB
Found 1 hit for monomerid = 107756
Trg + Lig
Ki
nM
ΔG°
kcal/mole
IC50
nM
Kd
nM
EC50/IC50
nM
koff
s-1
kon
M-1s-1
pHTemp
°C
Cyclin-dependent kinase 4
(Oryctolagus cuniculus (Rabbit))
BDBM107756
(US8598217, 163)
Show SMILES O=C(c1nc2nc(ccc2[nH]1)N1CCCNCC1)c1ccnc(c1)-c1cncc2ccccc12
Show InChI InChI=1S/C26H23N7O/c34-24(17-8-10-29-22(14-17)20-16-28-15-18-4-1-2-5-19(18)20)26-30-21-6-7-23(31-25(21)32-26)33-12-3-9-27-11-13-33/h1-2,4-8,10,14-16,27H,3,9,11-13H2,(H,30,31,32)
US Patent
n/an/a 14n/an/an/an/a7.5n/a
Astex Therapeutics Ltd.; Novartis AG
US Patent
Assay Description
A 384-well microtiter Lance TR-FRET (time-resolved-fluorescence energy transfer) endpoint assay was used for CDK4/cyclin D1 kinase activity measureme...
US Patent US8598217 (2013)
BindingDB Entry DOI: 10.7270/Q2BG2MN8