BDBM108065 1‐ethylindole‐2,3‐dione (Compound 3)
SMILES: CCN1C(=O)C(=O)c2ccccc12
InChI Key: InChIKey=ORYSFKVWQQMDAX-UHFFFAOYSA-N
Data: 1 IC50
PDB links: 1 PDB ID matches this monomer.
Activity Spreadsheet -- Enzyme Inhibition Constant Data from BindingDB
Found 1 hit for monomerid = 108065
Trg + Lig
Ki
nM
ΔG°
kcal/mole
IC50
nM
Kd
nM
EC50/IC50
nM
koff
s-1
kon
M-1s-1
pHTemp
°C
Chorismate mutase (MTB CM)
(Mycobacterium tuberculosis H37Rv)
BDBM108065
(1‐ethylindole‐2,3‐dione (Compoun...)
Show SMILES CCN1C(=O)C(=O)c2ccccc12
Show InChI InChI=1S/C10H9NO2/c1-2-11-8-6-4-3-5-7(8)9(12)10(11)13/h3-6H,2H2,1H3
n/an/a 2.27E+4n/an/an/an/an/a37
Birla Institute of Technology & Science-Pilani, Hyderabad Campus, Shameerpet, R.R. District, Hyderabad, Andhra Pradesh, 500078, India
Assay Description
The reaction was initiated by the addition of 150pmoles of enzyme to a mixture of inhibitor (40µM, 20 µM, 10 µM, 5 µM, 1 µM ...
Chem Biol Drug Des 83: 498-506 (2014)
Article DOI: 10.1111/cbdd.12265
BindingDB Entry DOI: 10.7270/Q2F76B65