BDBM10807 1-[methyl(prop-2-yn-1-yl)amino]-2,3-dihydro-1H-inden-4-ol::Aminoindan deriv. 40w
SMILES: CN(CC#C)C1CCc2c1cccc2O
InChI Key: InChIKey=CVBIGHLFBOZQTD-UHFFFAOYSA-N
Data: 2 IC50
Activity Spreadsheet -- Enzyme Inhibition Constant Data from BindingDB
Found 2 hits for monomerid = 10807
Trg + Lig
Ki
nM
ΔG°
kcal/mole
IC50
nM
Kd
nM
EC50/IC50
nM
koff
s-1
kon
M-1s-1
pHTemp
°C
Monoamine Oxidase Type B (MAO-B)
(Rattus norvegicus (rat))
BDBM10807
(1-[methyl(prop-2-yn-1-yl)amino]-2,3-dihydro-1H-ind...)
Show SMILES CN(CC#C)C1CCc2c1cccc2O
Show InChI InChI=1S/C13H15NO/c1-3-9-14(2)12-8-7-11-10(12)5-4-6-13(11)15/h1,4-6,12,15H,7-9H2,2H3
n/an/a 70n/an/an/an/an/an/a
Teva Pharmaceutical Industries
Assay Description
Inhibition of MAO activity was determined by a radiometric procedure from Tipton and Youdim. Homogenized rat brain was used as the source of enzymes....
J Med Chem 45: 5260-79 (2002)
Article DOI: 10.1021/jm020120c
BindingDB Entry DOI: 10.7270/Q2GQ6W07
Monoamine oxidase
(Rattus norvegicus (rat))
BDBM10807
(1-[methyl(prop-2-yn-1-yl)amino]-2,3-dihydro-1H-ind...)
Show SMILES CN(CC#C)C1CCc2c1cccc2O
Show InChI InChI=1S/C13H15NO/c1-3-9-14(2)12-8-7-11-10(12)5-4-6-13(11)15/h1,4-6,12,15H,7-9H2,2H3
n/an/a 8n/an/an/an/an/an/a
Teva Pharmaceutical Industries
Assay Description
Inhibition of MAO activity was determined by a radiometric procedure from Tipton and Youdim. Homogenized rat brain was used as the source of enzymes....
J Med Chem 45: 5260-79 (2002)
Article DOI: 10.1021/jm020120c
BindingDB Entry DOI: 10.7270/Q2GQ6W07