BDBM108077 5‐(2,5‐dimethylphenyl)‐1H‐indole‐2,3‐dione (Compound 18)
SMILES: Cc1ccc(C)c(c1)-c1ccc2NC(=O)C(=O)c2c1
InChI Key: InChIKey=VYKJPQVTPFMFTF-UHFFFAOYSA-N
Data: 1 IC50
Activity Spreadsheet -- Enzyme Inhibition Constant Data from BindingDB
Found 1 hit for monomerid = 108077
Trg + Lig
Ki
nM
ΔG°
kcal/mole
IC50
nM
Kd
nM
EC50/IC50
nM
koff
s-1
kon
M-1s-1
pHTemp
°C
Chorismate mutase (MTB CM)
(Mycobacterium tuberculosis H37Rv)
BDBM108077
(5‐(2,5‐dimethylphenyl)‐1H‐...)
Show SMILES Cc1ccc(C)c(c1)-c1ccc2NC(=O)C(=O)c2c1
Show InChI InChI=1S/C16H13NO2/c1-9-3-4-10(2)12(7-9)11-5-6-14-13(8-11)15(18)16(19)17-14/h3-8H,1-2H3,(H,17,18,19)
n/an/a 3.65E+4n/an/an/an/an/a37
Birla Institute of Technology & Science-Pilani, Hyderabad Campus, Shameerpet, R.R. District, Hyderabad, Andhra Pradesh, 500078, India
Assay Description
The reaction was initiated by the addition of 150pmoles of enzyme to a mixture of inhibitor (40µM, 20 µM, 10 µM, 5 µM, 1 µM ...
Chem Biol Drug Des 83: 498-506 (2014)
Article DOI: 10.1111/cbdd.12265
BindingDB Entry DOI: 10.7270/Q2F76B65