BDBM108079 5‐(4‐methylpiperazin‐1‐yl)‐1H‐indole‐2,3‐dione (Compound 20)
SMILES: CN1CCN(CC1)c1ccc2NC(=O)C(=O)c2c1
InChI Key: InChIKey=FXLKEKQTAQLTJB-UHFFFAOYSA-N
Data: 1 IC50
Activity Spreadsheet -- Enzyme Inhibition Constant Data from BindingDB
Found 1 hit for monomerid = 108079
Trg + Lig
Ki
nM
ΔG°
kcal/mole
IC50
nM
Kd
nM
EC50/IC50
nM
koff
s-1
kon
M-1s-1
pHTemp
°C
Secreted chorismate mutase
(Mycobacterium tuberculosis H37Rv)
BDBM108079
(5‐(4‐methylpiperazin‐1‐yl)...)
Show SMILES CN1CCN(CC1)c1ccc2NC(=O)C(=O)c2c1
Show InChI InChI=1S/C13H15N3O2/c1-15-4-6-16(7-5-15)9-2-3-11-10(8-9)12(17)13(18)14-11/h2-3,8H,4-7H2,1H3,(H,14,17,18)
n/an/a 3.19E+4n/an/an/an/an/a37
Birla Institute of Technology & Science-Pilani, Hyderabad Campus, Shameerpet, R.R. District, Hyderabad, Andhra Pradesh, 500078, India
Assay Description
The reaction was initiated by the addition of 150pmoles of enzyme to a mixture of inhibitor (40µM, 20 µM, 10 µM, 5 µM, 1 µM ...
Chem Biol Drug Des 83: 498-506 (2014)
Article DOI: 10.1111/cbdd.12265
BindingDB Entry DOI: 10.7270/Q2F76B65