BDBM10824 3-{2-[methyl(prop-2-yn-1-yl)amino]propyl}phenyl N-ethyl-N-methylcarbamate::Phenethylamine deriv. 53b
SMILES: CCN(C)C(=O)Oc1cccc(CC(C)N(C)CC#C)c1
InChI Key: InChIKey=YOOMCQRTUQTUJB-UHFFFAOYSA-N
Data: 4 IC50
Activity Spreadsheet -- Enzyme Inhibition Constant Data from BindingDB
Found 4 hits for monomerid = 10824
Trg + Lig
Ki
nM
ΔG°
kcal/mole
IC50
nM
Kd
nM
EC50/IC50
nM
koff
s-1
kon
M-1s-1
pHTemp
°C
Acetylcholinesterase
(Homo sapiens (Human))
BDBM10824
(3-{2-[methyl(prop-2-yn-1-yl)amino]propyl}phenyl N-...)
Show SMILES CCN(C)C(=O)Oc1cccc(CC(C)N(C)CC#C)c1
Show InChI InChI=1S/C17H24N2O2/c1-6-11-19(5)14(3)12-15-9-8-10-16(13-15)21-17(20)18(4)7-2/h1,8-10,13-14H,7,11-12H2,2-5H3
NCI pathway
Reactome pathway
n/an/a 2.34E+5n/an/an/an/an/an/a
Teva Pharmaceutical Industries
Assay Description
The cholinesterase assays were performed using colorimetric method reported by Ellman. The absorbance changes at 412 nm were recorded for 5 min with ...
J Med Chem 45: 5260-79 (2002)
Article DOI: 10.1021/jm020120c
BindingDB Entry DOI: 10.7270/Q2GQ6W07
Monoamine Oxidase Type B (MAO-B)
(Rattus norvegicus (rat))
BDBM10824
(3-{2-[methyl(prop-2-yn-1-yl)amino]propyl}phenyl N-...)
Show SMILES CCN(C)C(=O)Oc1cccc(CC(C)N(C)CC#C)c1
Show InChI InChI=1S/C17H24N2O2/c1-6-11-19(5)14(3)12-15-9-8-10-16(13-15)21-17(20)18(4)7-2/h1,8-10,13-14H,7,11-12H2,2-5H3
n/an/a 100n/an/an/an/an/an/a
Teva Pharmaceutical Industries
Assay Description
Inhibition of MAO activity was determined by a radiometric procedure from Tipton and Youdim. Homogenized rat brain was used as the source of enzymes....
J Med Chem 45: 5260-79 (2002)
Article DOI: 10.1021/jm020120c
BindingDB Entry DOI: 10.7270/Q2GQ6W07
Monoamine oxidase
(Rattus norvegicus (rat))
BDBM10824
(3-{2-[methyl(prop-2-yn-1-yl)amino]propyl}phenyl N-...)
Show SMILES CCN(C)C(=O)Oc1cccc(CC(C)N(C)CC#C)c1
Show InChI InChI=1S/C17H24N2O2/c1-6-11-19(5)14(3)12-15-9-8-10-16(13-15)21-17(20)18(4)7-2/h1,8-10,13-14H,7,11-12H2,2-5H3
n/an/a 120n/an/an/an/an/an/a
Teva Pharmaceutical Industries
Assay Description
Inhibition of MAO activity was determined by a radiometric procedure from Tipton and Youdim. Homogenized rat brain was used as the source of enzymes....
J Med Chem 45: 5260-79 (2002)
Article DOI: 10.1021/jm020120c
BindingDB Entry DOI: 10.7270/Q2GQ6W07
Butyrylcholinesterase (BChE)
(Equus caballus (Horse))
BDBM10824
(3-{2-[methyl(prop-2-yn-1-yl)amino]propyl}phenyl N-...)
Show SMILES CCN(C)C(=O)Oc1cccc(CC(C)N(C)CC#C)c1
Show InChI InChI=1S/C17H24N2O2/c1-6-11-19(5)14(3)12-15-9-8-10-16(13-15)21-17(20)18(4)7-2/h1,8-10,13-14H,7,11-12H2,2-5H3
n/an/a 1.50E+3n/an/an/an/an/an/a
Teva Pharmaceutical Industries
Assay Description
The cholinesterase assays were performed using colorimetric method reported by Ellman. The absorbance changes at 412 nm were recorded for 5 min with ...
J Med Chem 45: 5260-79 (2002)
Article DOI: 10.1021/jm020120c
BindingDB Entry DOI: 10.7270/Q2GQ6W07