BDBM10829 3-(N-Methyl,Ncyclohexylcarbamyloxy)-N-methyl-N-propargylphenylpropylamine Mesylate::3-{2-[methyl(prop-2-yn-1-yl)amino]propyl}phenyl N-cyclohexyl-N-methylcarbamate; methanesulfonic acid::Phenethylamine deriv. 53e
SMILES: CC(Cc1cccc(OC(=O)N(C)C2CCCCC2)c1)N(C)CC#C
InChI Key: InChIKey=FTMQGFFVKGHYEQ-UHFFFAOYSA-N
Data: 4 IC50
Activity Spreadsheet -- Enzyme Inhibition Constant Data from BindingDB
Found 4 hits for monomerid = 10829
Trg + Lig
Ki
nM
ΔG°
kcal/mole
IC50
nM
Kd
nM
EC50/IC50
nM
koff
s-1
kon
M-1s-1
pHTemp
°C
Acetylcholinesterase
(Homo sapiens (Human))
BDBM10829
(3-(N-Methyl,Ncyclohexylcarbamyloxy)-N-methyl-N-pro...)
Show SMILES CC(Cc1cccc(OC(=O)N(C)C2CCCCC2)c1)N(C)CC#C
Show InChI InChI=1S/C21H30N2O2/c1-5-14-22(3)17(2)15-18-10-9-13-20(16-18)25-21(24)23(4)19-11-7-6-8-12-19/h1,9-10,13,16-17,19H,6-8,11-12,14-15H2,2-4H3
NCI pathway
Reactome pathway
n/an/a 8.67E+3n/an/an/an/an/an/a
Teva Pharmaceutical Industries
Assay Description
The cholinesterase assays were performed using colorimetric method reported by Ellman. The absorbance changes at 412 nm were recorded for 5 min with ...
J Med Chem 45: 5260-79 (2002)
Article DOI: 10.1021/jm020120c
BindingDB Entry DOI: 10.7270/Q2GQ6W07
Monoamine Oxidase Type B (MAO-B)
(Rattus norvegicus (rat))
BDBM10829
(3-(N-Methyl,Ncyclohexylcarbamyloxy)-N-methyl-N-pro...)
Show SMILES CC(Cc1cccc(OC(=O)N(C)C2CCCCC2)c1)N(C)CC#C
Show InChI InChI=1S/C21H30N2O2/c1-5-14-22(3)17(2)15-18-10-9-13-20(16-18)25-21(24)23(4)19-11-7-6-8-12-19/h1,9-10,13,16-17,19H,6-8,11-12,14-15H2,2-4H3
n/an/a 240n/an/an/an/an/an/a
Teva Pharmaceutical Industries
Assay Description
Inhibition of MAO activity was determined by a radiometric procedure from Tipton and Youdim. Homogenized rat brain was used as the source of enzymes....
J Med Chem 45: 5260-79 (2002)
Article DOI: 10.1021/jm020120c
BindingDB Entry DOI: 10.7270/Q2GQ6W07
Monoamine oxidase
(Rattus norvegicus (rat))
BDBM10829
(3-(N-Methyl,Ncyclohexylcarbamyloxy)-N-methyl-N-pro...)
Show SMILES CC(Cc1cccc(OC(=O)N(C)C2CCCCC2)c1)N(C)CC#C
Show InChI InChI=1S/C21H30N2O2/c1-5-14-22(3)17(2)15-18-10-9-13-20(16-18)25-21(24)23(4)19-11-7-6-8-12-19/h1,9-10,13,16-17,19H,6-8,11-12,14-15H2,2-4H3
n/an/a 1.70E+3n/an/an/an/an/an/a
Teva Pharmaceutical Industries
Assay Description
Inhibition of MAO activity was determined by a radiometric procedure from Tipton and Youdim. Homogenized rat brain was used as the source of enzymes....
J Med Chem 45: 5260-79 (2002)
Article DOI: 10.1021/jm020120c
BindingDB Entry DOI: 10.7270/Q2GQ6W07
Butyrylcholinesterase (BChE)
(Equus caballus (Horse))
BDBM10829
(3-(N-Methyl,Ncyclohexylcarbamyloxy)-N-methyl-N-pro...)
Show SMILES CC(Cc1cccc(OC(=O)N(C)C2CCCCC2)c1)N(C)CC#C
Show InChI InChI=1S/C21H30N2O2/c1-5-14-22(3)17(2)15-18-10-9-13-20(16-18)25-21(24)23(4)19-11-7-6-8-12-19/h1,9-10,13,16-17,19H,6-8,11-12,14-15H2,2-4H3
n/an/a 670n/an/an/an/an/an/a
Teva Pharmaceutical Industries
Assay Description
The cholinesterase assays were performed using colorimetric method reported by Ellman. The absorbance changes at 412 nm were recorded for 5 min with ...
J Med Chem 45: 5260-79 (2002)
Article DOI: 10.1021/jm020120c
BindingDB Entry DOI: 10.7270/Q2GQ6W07