BDBM108428 US8609688, 6
SMILES: CC(C)(O)C(=O)Nc1cccc(c1)-c1ccc2nc(-c3cccnc3N)n(-c3ccc(cc3)C3(N)CCC3)c2n1
InChI Key: InChIKey=GRDNCQFNSUBTSA-UHFFFAOYSA-N
Data: 2 IC50  2 Kd
Activity Spreadsheet -- Enzyme Inhibition Constant Data from BindingDB
Found 4 hits for monomerid = 108428
Trg + Lig
Ki
nM
ΔG°
kcal/mole
IC50
nM
Kd
nM
EC50/IC50
nM
koff
s-1
kon
M-1s-1
pHTemp
°C
RAC-alpha serine/threonine-protein kinase
(Homo sapiens (Human))
BDBM108428
(US8609688, 6)
Show SMILES CC(C)(O)C(=O)Nc1cccc(c1)-c1ccc2nc(-c3cccnc3N)n(-c3ccc(cc3)C3(N)CCC3)c2n1
Show InChI InChI=1S/C31H31N7O2/c1-30(2,40)29(39)35-21-7-3-6-19(18-21)24-13-14-25-28(36-24)38(27(37-25)23-8-4-17-34-26(23)32)22-11-9-20(10-12-22)31(33)15-5-16-31/h3-4,6-14,17-18,40H,5,15-16,33H2,1-2H3,(H2,32,34)(H,35,39)
US Patent
n/an/an/a 1.40n/an/an/a7.580
ArQule, Inc.
US Patent
Assay Description
Protein-ligand binding was identified with the thermal shift assay which is based on the ligand-induced stabilization of the protein tertiary structu...
US Patent US8609688 (2013)
BindingDB Entry DOI: 10.7270/Q2H41Q2M
RAC-alpha serine/threonine-protein kinase
(Homo sapiens (Human))
BDBM108428
(US8609688, 6)
Show SMILES CC(C)(O)C(=O)Nc1cccc(c1)-c1ccc2nc(-c3cccnc3N)n(-c3ccc(cc3)C3(N)CCC3)c2n1
Show InChI InChI=1S/C31H31N7O2/c1-30(2,40)29(39)35-21-7-3-6-19(18-21)24-13-14-25-28(36-24)38(27(37-25)23-8-4-17-34-26(23)32)22-11-9-20(10-12-22)31(33)15-5-16-31/h3-4,6-14,17-18,40H,5,15-16,33H2,1-2H3,(H2,32,34)(H,35,39)
US Patent
n/an/a 1.63n/an/an/an/an/an/a
ArQule, Inc.
US Patent
Assay Description
AKT1 activity was assayed using the GSK3-derived biotinylated peptide substrate, crosstide (biotin-GRPRTSSFAEG), and AlphaScreen (Amplified Luminesce...
US Patent US8962619 (2015)
BindingDB Entry DOI: 10.7270/Q2W957W7
RAC-alpha serine/threonine-protein kinase
(Homo sapiens (Human))
BDBM108428
(US8609688, 6)
Show SMILES CC(C)(O)C(=O)Nc1cccc(c1)-c1ccc2nc(-c3cccnc3N)n(-c3ccc(cc3)C3(N)CCC3)c2n1
Show InChI InChI=1S/C31H31N7O2/c1-30(2,40)29(39)35-21-7-3-6-19(18-21)24-13-14-25-28(36-24)38(27(37-25)23-8-4-17-34-26(23)32)22-11-9-20(10-12-22)31(33)15-5-16-31/h3-4,6-14,17-18,40H,5,15-16,33H2,1-2H3,(H2,32,34)(H,35,39)
US Patent
n/an/an/a 1.40n/an/an/an/an/a
ArQule, Inc.
US Patent
Assay Description
Binding analysis. Protein-ligand binding was identified with the thermal shift assay which is based on the ligand-induced stabilization of the protei...
US Patent US8962619 (2015)
BindingDB Entry DOI: 10.7270/Q2W957W7
RAC-alpha serine/threonine-protein kinase
(Homo sapiens (Human))
BDBM108428
(US8609688, 6)
Show SMILES CC(C)(O)C(=O)Nc1cccc(c1)-c1ccc2nc(-c3cccnc3N)n(-c3ccc(cc3)C3(N)CCC3)c2n1
Show InChI InChI=1S/C31H31N7O2/c1-30(2,40)29(39)35-21-7-3-6-19(18-21)24-13-14-25-28(36-24)38(27(37-25)23-8-4-17-34-26(23)32)22-11-9-20(10-12-22)31(33)15-5-16-31/h3-4,6-14,17-18,40H,5,15-16,33H2,1-2H3,(H2,32,34)(H,35,39)
US Patent
n/an/a 1.63n/an/an/an/a8.025
ArQule, Inc.
US Patent
Assay Description
AKT1 activity was assayed using the GSK3-derived biotinylated peptide substrate, crosstide (biotin-GRPRTSSFAEG), and AlphaScreen™ (Amplified Lum...
US Patent US8609688 (2013)
BindingDB Entry DOI: 10.7270/Q2H41Q2M