BDBM108871 US8604016, 451::US9938267, Cmpd ID 451
SMILES: CC(=O)Nc1cccc(CC(=O)Nc2nnc(CCCCc3ccc(NC(=O)Cc4ccccc4)nn3)s2)c1
InChI Key: InChIKey=LUPKTWUOXFHXMW-UHFFFAOYSA-N
Data: 2 IC50
Activity Spreadsheet -- Enzyme Inhibition Constant Data from BindingDB
Found 2 hits for monomerid = 108871
Trg + Lig
Ki
nM
ΔG°
kcal/mole
IC50
nM
Kd
nM
EC50/IC50
nM
koff
s-1
kon
M-1s-1
pHTemp
°C
Glutaminase kidney isoform, mitochondrial
(Homo sapiens (Human))
BDBM108871
(US8604016, 451 | US9938267, Cmpd ID 451)
Show SMILES CC(=O)Nc1cccc(CC(=O)Nc2nnc(CCCCc3ccc(NC(=O)Cc4ccccc4)nn3)s2)c1
Show InChI InChI=1S/C28H29N7O3S/c1-19(36)29-23-12-7-10-21(16-23)18-26(38)31-28-35-34-27(39-28)13-6-5-11-22-14-15-24(33-32-22)30-25(37)17-20-8-3-2-4-9-20/h2-4,7-10,12,14-16H,5-6,11,13,17-18H2,1H3,(H,29,36)(H,30,33,37)(H,31,35,38)
US Patent
n/an/a 3n/an/an/an/an/an/a
Amgen
Assay Description
Compounds were assessed for their ability to inhibit the enzymatic activity of a recombinant form of Glutaminase 1 (GAC) using a biochemical assay th...
J Med Chem 51: 1681-94 (2008)
BindingDB Entry DOI: 10.7270/Q2JS9SQV
Glutaminase kidney isoform, mitochondrial
(Homo sapiens (Human))
BDBM108871
(US8604016, 451 | US9938267, Cmpd ID 451)
Show SMILES CC(=O)Nc1cccc(CC(=O)Nc2nnc(CCCCc3ccc(NC(=O)Cc4ccccc4)nn3)s2)c1
Show InChI InChI=1S/C28H29N7O3S/c1-19(36)29-23-12-7-10-21(16-23)18-26(38)31-28-35-34-27(39-28)13-6-5-11-22-14-15-24(33-32-22)30-25(37)17-20-8-3-2-4-9-20/h2-4,7-10,12,14-16H,5-6,11,13,17-18H2,1H3,(H,29,36)(H,30,33,37)(H,31,35,38)
US Patent
n/an/a 3n/an/an/an/an/an/a
Calithera Biosciences Inc.
US Patent
Assay Description
Compounds were assessed for their ability to inhibit the enzymatic activity of a recombinant form of Glutaminase 1 (GAC) using a biochemical assay th...
US Patent US8604016 (2013)
BindingDB Entry DOI: 10.7270/Q2CC0ZBW