BDBM108920 US8604016, 501::US9938267, Cmpd ID 501
SMILES: CCOC(=O)Cc1cccc(CC(=O)Nc2ccc(CCCCc3nnc(NC(=O)Cc4ccccc4)s3)nn2)c1
InChI Key: InChIKey=XSWAJRJEVVADBB-UHFFFAOYSA-N
Data: 2 IC50
Activity Spreadsheet -- Enzyme Inhibition Constant Data from BindingDB
Found 2 hits for monomerid = 108920
Trg + Lig
Ki
nM
ΔG°
kcal/mole
IC50
nM
Kd
nM
EC50/IC50
nM
koff
s-1
kon
M-1s-1
pHTemp
°C
Glutaminase kidney isoform, mitochondrial
(Homo sapiens (Human))
BDBM108920
(US8604016, 501 | US9938267, Cmpd ID 501)
Show SMILES CCOC(=O)Cc1cccc(CC(=O)Nc2ccc(CCCCc3nnc(NC(=O)Cc4ccccc4)s3)nn2)c1
Show InChI InChI=1S/C30H32N6O4S/c1-2-40-29(39)20-23-12-8-11-22(17-23)19-26(37)31-25-16-15-24(33-34-25)13-6-7-14-28-35-36-30(41-28)32-27(38)18-21-9-4-3-5-10-21/h3-5,8-12,15-17H,2,6-7,13-14,18-20H2,1H3,(H,31,34,37)(H,32,36,38)
US Patent
n/an/a 4n/an/an/an/an/an/a
Amgen
Assay Description
Compounds were assessed for their ability to inhibit the enzymatic activity of a recombinant form of Glutaminase 1 (GAC) using a biochemical assay th...
J Med Chem 51: 1681-94 (2008)
BindingDB Entry DOI: 10.7270/Q2JS9SQV
Glutaminase kidney isoform, mitochondrial
(Homo sapiens (Human))
BDBM108920
(US8604016, 501 | US9938267, Cmpd ID 501)
Show SMILES CCOC(=O)Cc1cccc(CC(=O)Nc2ccc(CCCCc3nnc(NC(=O)Cc4ccccc4)s3)nn2)c1
Show InChI InChI=1S/C30H32N6O4S/c1-2-40-29(39)20-23-12-8-11-22(17-23)19-26(37)31-25-16-15-24(33-34-25)13-6-7-14-28-35-36-30(41-28)32-27(38)18-21-9-4-3-5-10-21/h3-5,8-12,15-17H,2,6-7,13-14,18-20H2,1H3,(H,31,34,37)(H,32,36,38)
US Patent
n/an/a 4n/an/an/an/an/an/a
Calithera Biosciences Inc.
US Patent
Assay Description
Compounds were assessed for their ability to inhibit the enzymatic activity of a recombinant form of Glutaminase 1 (GAC) using a biochemical assay th...
US Patent US8604016 (2013)
BindingDB Entry DOI: 10.7270/Q2CC0ZBW