BDBM109048 US8604016, 630::US9938267, Cmpd ID 630
SMILES: CC(C)(C)OC(=O)NC(C)(C)c1cccc(CC(=O)Nc2nnc(CCCCc3ccc(NC(=O)Cc4ccccc4)nn3)s2)c1
InChI Key: InChIKey=KESRXTZBWLSUED-UHFFFAOYSA-N
Data: 2 IC50
Activity Spreadsheet -- Enzyme Inhibition Constant Data from BindingDB
Found 2 hits for monomerid = 109048
Trg + Lig
Ki
nM
ΔG°
kcal/mole
IC50
nM
Kd
nM
EC50/IC50
nM
koff
s-1
kon
M-1s-1
pHTemp
°C
Glutaminase kidney isoform, mitochondrial
(Homo sapiens (Human))
BDBM109048
(US8604016, 630 | US9938267, Cmpd ID 630)
Show SMILES CC(C)(C)OC(=O)NC(C)(C)c1cccc(CC(=O)Nc2nnc(CCCCc3ccc(NC(=O)Cc4ccccc4)nn3)s2)c1
Show InChI InChI=1S/C34H41N7O4S/c1-33(2,3)45-32(44)37-34(4,5)25-15-11-14-24(20-25)22-29(43)36-31-41-40-30(46-31)17-10-9-16-26-18-19-27(39-38-26)35-28(42)21-23-12-7-6-8-13-23/h6-8,11-15,18-20H,9-10,16-17,21-22H2,1-5H3,(H,37,44)(H,35,39,42)(H,36,41,43)
US Patent
n/an/a 4n/an/an/an/an/an/a
Amgen
Assay Description
Compounds were assessed for their ability to inhibit the enzymatic activity of a recombinant form of Glutaminase 1 (GAC) using a biochemical assay th...
J Med Chem 51: 1681-94 (2008)
BindingDB Entry DOI: 10.7270/Q2JS9SQV
Glutaminase kidney isoform, mitochondrial
(Homo sapiens (Human))
BDBM109048
(US8604016, 630 | US9938267, Cmpd ID 630)
Show SMILES CC(C)(C)OC(=O)NC(C)(C)c1cccc(CC(=O)Nc2nnc(CCCCc3ccc(NC(=O)Cc4ccccc4)nn3)s2)c1
Show InChI InChI=1S/C34H41N7O4S/c1-33(2,3)45-32(44)37-34(4,5)25-15-11-14-24(20-25)22-29(43)36-31-41-40-30(46-31)17-10-9-16-26-18-19-27(39-38-26)35-28(42)21-23-12-7-6-8-13-23/h6-8,11-15,18-20H,9-10,16-17,21-22H2,1-5H3,(H,37,44)(H,35,39,42)(H,36,41,43)
US Patent
n/an/a 4n/an/an/an/an/an/a
Calithera Biosciences Inc.
US Patent
Assay Description
Compounds were assessed for their ability to inhibit the enzymatic activity of a recombinant form of Glutaminase 1 (GAC) using a biochemical assay th...
US Patent US8604016 (2013)
BindingDB Entry DOI: 10.7270/Q2CC0ZBW