BDBM109063 US8604016, 647::US9938267, Cmpd ID 647
SMILES: CC(C)CNC(=O)COc1cccc(CC(=O)Nc2ccc(CCCCc3nnc(NC(=O)Cc4ccccc4)s3)nn2)c1
InChI Key: InChIKey=YIPBNAJMHCASCU-UHFFFAOYSA-N
Data: 2 IC50
Activity Spreadsheet -- Enzyme Inhibition Constant Data from BindingDB
Found 2 hits for monomerid = 109063
Trg + Lig
Ki
nM
ΔG°
kcal/mole
IC50
nM
Kd
nM
EC50/IC50
nM
koff
s-1
kon
M-1s-1
pHTemp
°C
Glutaminase kidney isoform, mitochondrial
(Homo sapiens (Human))
BDBM109063
(US8604016, 647 | US9938267, Cmpd ID 647)
Show SMILES CC(C)CNC(=O)COc1cccc(CC(=O)Nc2ccc(CCCCc3nnc(NC(=O)Cc4ccccc4)s3)nn2)c1
Show InChI InChI=1S/C32H37N7O4S/c1-22(2)20-33-30(42)21-43-26-13-8-11-24(17-26)19-28(40)34-27-16-15-25(36-37-27)12-6-7-14-31-38-39-32(44-31)35-29(41)18-23-9-4-3-5-10-23/h3-5,8-11,13,15-17,22H,6-7,12,14,18-21H2,1-2H3,(H,33,42)(H,34,37,40)(H,35,39,41)
US Patent
n/an/a 4n/an/an/an/an/an/a
Amgen
Assay Description
Compounds were assessed for their ability to inhibit the enzymatic activity of a recombinant form of Glutaminase 1 (GAC) using a biochemical assay th...
J Med Chem 51: 1681-94 (2008)
BindingDB Entry DOI: 10.7270/Q2JS9SQV
Glutaminase kidney isoform, mitochondrial
(Homo sapiens (Human))
BDBM109063
(US8604016, 647 | US9938267, Cmpd ID 647)
Show SMILES CC(C)CNC(=O)COc1cccc(CC(=O)Nc2ccc(CCCCc3nnc(NC(=O)Cc4ccccc4)s3)nn2)c1
Show InChI InChI=1S/C32H37N7O4S/c1-22(2)20-33-30(42)21-43-26-13-8-11-24(17-26)19-28(40)34-27-16-15-25(36-37-27)12-6-7-14-31-38-39-32(44-31)35-29(41)18-23-9-4-3-5-10-23/h3-5,8-11,13,15-17,22H,6-7,12,14,18-21H2,1-2H3,(H,33,42)(H,34,37,40)(H,35,39,41)
US Patent
n/an/a 4n/an/an/an/an/an/a
Calithera Biosciences Inc.
US Patent
Assay Description
Compounds were assessed for their ability to inhibit the enzymatic activity of a recombinant form of Glutaminase 1 (GAC) using a biochemical assay th...
US Patent US8604016 (2013)
BindingDB Entry DOI: 10.7270/Q2CC0ZBW