null
SMILES: Cc1nc(cs1)C#Cc1ccc(nc1)-c1ccccc1F
InChI Key: InChIKey=LQISSXBJGQQINL-UHFFFAOYSA-N
Activity Spreadsheet -- Enzyme Inhibition Constant Data from BindingDB
Found 1 hit for monomerid = 109096
Trg + Lig
Ki
nM
ΔG°
kcal/mole
IC50
nM
Kd
nM
EC50/IC50
nM
koff
s-1
kon
M-1s-1
pHTemp
°C
Metabotropic glutamate receptor 5
(Rattus norvegicus (Rat))
BDBM109096
(US8609852, 2)
Show SMILES Cc1nc(cs1)C#Cc1ccc(nc1)-c1ccccc1F
Show InChI InChI=1S/C17H11FN2S/c1-12-20-14(11-21-12)8-6-13-7-9-17(19-10-13)15-4-2-3-5-16(15)18/h2-5,7,9-11H,1H3
Reactome pathway
US Patent
2 -11.9n/an/an/an/an/an/a25
Merck Sharp & Dohme Corp.
US Patent
Assay Description
Binding assays were performed as described in Schaffhauser H, Richards J G, Cartmell J, Chaboz S, Kemp J A, Klingelschmidt A, Messer J, Stadler H, Wo...
US Patent US8609852 (2013)
BindingDB Entry DOI: 10.7270/Q27M06K3