BDBM109110 US8609852, 17
SMILES: Cc1nc(cs1)C#Cc1ccc(nc1)-n1ccc2cccnc12
InChI Key: InChIKey=CBRFIGWEJFZHAF-UHFFFAOYSA-N
Data: 1 KI
Activity Spreadsheet -- Enzyme Inhibition Constant Data from BindingDB
Found 1 hit for monomerid = 109110
Trg + Lig
Ki
nM
ΔG°
kcal/mole
IC50
nM
Kd
nM
EC50/IC50
nM
koff
s-1
kon
M-1s-1
pHTemp
°C
Metabotropic glutamate receptor
(Rattus norvegicus (Rat))
BDBM109110
(US8609852, 17)
Show SMILES Cc1nc(cs1)C#Cc1ccc(nc1)-n1ccc2cccnc12
Show InChI InChI=1S/C18H12N4S/c1-13-21-16(12-23-13)6-4-14-5-7-17(20-11-14)22-10-8-15-3-2-9-19-18(15)22/h2-3,5,7-12H,1H3
Reactome pathway
US Patent
3.80 -11.5n/an/an/an/an/an/a25
Merck Sharp & Dohme Corp.
US Patent
Assay Description
Binding assays were performed as described in Schaffhauser H, Richards J G, Cartmell J, Chaboz S, Kemp J A, Klingelschmidt A, Messer J, Stadler H, Wo...
US Patent US8609852 (2013)
BindingDB Entry DOI: 10.7270/Q27M06K3