BDBM109116 US8609852, 23
SMILES: CC1CCCN(C1)c1ncc(cn1)C#Cc1csc(C)n1
InChI Key: InChIKey=FBGBUEGTKNWRDU-UHFFFAOYSA-N
Data: 1 KI
Activity Spreadsheet -- Enzyme Inhibition Constant Data from BindingDB
Found 1 hit for monomerid = 109116
Trg + Lig
Ki
nM
ΔG°
kcal/mole
IC50
nM
Kd
nM
EC50/IC50
nM
koff
s-1
kon
M-1s-1
pHTemp
°C
Metabotropic glutamate receptor
(Rattus norvegicus (Rat))
BDBM109116
(US8609852, 23)
Show SMILES CC1CCCN(C1)c1ncc(cn1)C#Cc1csc(C)n1
Show InChI InChI=1S/C16H18N4S/c1-12-4-3-7-20(10-12)16-17-8-14(9-18-16)5-6-15-11-21-13(2)19-15/h8-9,11-12H,3-4,7,10H2,1-2H3
Reactome pathway
US Patent
1.60 -12.0n/an/an/an/an/an/a25
Merck Sharp & Dohme Corp.
US Patent
Assay Description
Binding assays were performed as described in Schaffhauser H, Richards J G, Cartmell J, Chaboz S, Kemp J A, Klingelschmidt A, Messer J, Stadler H, Wo...
US Patent US8609852 (2013)
BindingDB Entry DOI: 10.7270/Q27M06K3