BDBM109145 US8609852, 52
SMILES: Cc1nc(cs1)C#Cc1ccc(nc1)-c1cccc(C)c1
InChI Key: InChIKey=PBACNLMUTVZHBM-UHFFFAOYSA-N
Data: 1 KI
Activity Spreadsheet -- Enzyme Inhibition Constant Data from BindingDB
Found 1 hit for monomerid = 109145
Trg + Lig
Ki
nM
ΔG°
kcal/mole
IC50
nM
Kd
nM
EC50/IC50
nM
koff
s-1
kon
M-1s-1
pHTemp
°C
Metabotropic glutamate receptor 5
(Rattus norvegicus (Rat))
BDBM109145
(US8609852, 52)
Show SMILES Cc1nc(cs1)C#Cc1ccc(nc1)-c1cccc(C)c1
Show InChI InChI=1S/C18H14N2S/c1-13-4-3-5-16(10-13)18-9-7-15(11-19-18)6-8-17-12-21-14(2)20-17/h3-5,7,9-12H,1-2H3
Reactome pathway
US Patent
2 -11.9n/an/an/an/an/an/a25
Merck Sharp & Dohme Corp.
US Patent
Assay Description
Binding assays were performed as described in Schaffhauser H, Richards J G, Cartmell J, Chaboz S, Kemp J A, Klingelschmidt A, Messer J, Stadler H, Wo...
US Patent US8609852 (2013)
BindingDB Entry DOI: 10.7270/Q27M06K3