BDBM109173 US8609852, 82
SMILES: CN(c1cccnc1)c1cncc(c1)C#Cc1csc(C)[nH+]1
InChI Key: InChIKey=IAHSYYSPDQZMFJ-UHFFFAOYSA-O
Data: 1 KI
Activity Spreadsheet -- Enzyme Inhibition Constant Data from BindingDB
Found 1 hit for monomerid = 109173
Trg + Lig
Ki
nM
ΔG°
kcal/mole
IC50
nM
Kd
nM
EC50/IC50
nM
koff
s-1
kon
M-1s-1
pHTemp
°C
Metabotropic glutamate receptor
(Rattus norvegicus (Rat))
BDBM109173
(US8609852, 82)
Show SMILES CN(c1cccnc1)c1cncc(c1)C#Cc1csc(C)[nH+]1
Show InChI InChI=1S/C17H14N4S/c1-13-20-15(12-22-13)6-5-14-8-17(11-19-9-14)21(2)16-4-3-7-18-10-16/h3-4,7-12H,1-2H3/p+1
Reactome pathway
US Patent
2 -11.9n/an/an/an/an/an/a25
Merck Sharp & Dohme Corp.
US Patent
Assay Description
Binding assays were performed as described in Schaffhauser H, Richards J G, Cartmell J, Chaboz S, Kemp J A, Klingelschmidt A, Messer J, Stadler H, Wo...
US Patent US8609852 (2013)
BindingDB Entry DOI: 10.7270/Q27M06K3