BDBM10951 (2S,6R)-3-methyl-8-oxa-3-azatricyclo[7.4.0.0^{2,6}]trideca-1(13),9,11-trien-10-yl N-methylcarbamate::Conformationally Restricted Rivastigmine Analogue 3
SMILES: [H][C@@]12CCN(C)[C@]1([H])c1cccc(OC(=O)NC)c1OC2
InChI Key: InChIKey=UKFCIGJAJAIROZ-CABZTGNLSA-N
Data: 8 IC50
Activity Spreadsheet -- Enzyme Inhibition Constant Data from BindingDB
Found 8 hits for monomerid = 10951
Trg + Lig
Ki
nM
ΔG°
kcal/mole
IC50
nM
Kd
nM
EC50/IC50
nM
koff
s-1
kon
M-1s-1
pHTemp
°C
Acetylcholinesterase
(Homo sapiens (Human))
BDBM10951
((2S,6R)-3-methyl-8-oxa-3-azatricyclo[7.4.0.0^{2,6}...)
Show SMILES [H][C@@]12CCN(C)[C@]1([H])c1cccc(OC(=O)NC)c1OC2 |r|
Show InChI InChI=1S/C14H18N2O3/c1-15-14(17)19-11-5-3-4-10-12-9(6-7-16(12)2)8-18-13(10)11/h3-5,9,12H,6-8H2,1-2H3,(H,15,17)/t9-,12-/m0/s1
NCI pathway
Reactome pathway
n/an/a 30n/an/an/an/a8.037
University of Bologna
Assay Description
The cholinesterase assays were performed using colorimetric method reported by Ellman. Enzyme activity was determined by measuring the absorbance at...
J Med Chem 47: 5945-52 (2004)
Article DOI: 10.1021/jm049782n
BindingDB Entry DOI: 10.7270/Q2668BD3
Cholinesterase
(Homo sapiens (Human))
BDBM10951
((2S,6R)-3-methyl-8-oxa-3-azatricyclo[7.4.0.0^{2,6}...)
Show SMILES [H][C@@]12CCN(C)[C@]1([H])c1cccc(OC(=O)NC)c1OC2 |r|
Show InChI InChI=1S/C14H18N2O3/c1-15-14(17)19-11-5-3-4-10-12-9(6-7-16(12)2)8-18-13(10)11/h3-5,9,12H,6-8H2,1-2H3,(H,15,17)/t9-,12-/m0/s1
Reactome pathway
n/an/a 59.4n/an/an/an/a8.037
University of Bologna
Assay Description
The cholinesterase assays were performed using colorimetric method reported by Ellman. Enzyme activity was determined by measuring the absorbance at...
J Med Chem 47: 5945-52 (2004)
Article DOI: 10.1021/jm049782n
BindingDB Entry DOI: 10.7270/Q2668BD3
Acetylcholinesterase
(Homo sapiens (Human))
BDBM10951
((2S,6R)-3-methyl-8-oxa-3-azatricyclo[7.4.0.0^{2,6}...)
Show SMILES [H][C@@]12CCN(C)[C@]1([H])c1cccc(OC(=O)NC)c1OC2 |r|
Show InChI InChI=1S/C14H18N2O3/c1-15-14(17)19-11-5-3-4-10-12-9(6-7-16(12)2)8-18-13(10)11/h3-5,9,12H,6-8H2,1-2H3,(H,15,17)/t9-,12-/m0/s1
NCI pathway
Reactome pathway
n/an/a 30n/an/an/an/an/an/a
University of Bologna
Curated by ChEMBL
Assay Description
Inhibitory activity against acetylcholinesterase in human erythrocytes
J Med Chem 44: 105-9 (2001)
BindingDB Entry DOI: 10.7270/Q2NG4RX2
Acetylcholinesterase
(Homo sapiens (Human))
BDBM10951
((2S,6R)-3-methyl-8-oxa-3-azatricyclo[7.4.0.0^{2,6}...)
Show SMILES [H][C@@]12CCN(C)[C@]1([H])c1cccc(OC(=O)NC)c1OC2 |r|
Show InChI InChI=1S/C14H18N2O3/c1-15-14(17)19-11-5-3-4-10-12-9(6-7-16(12)2)8-18-13(10)11/h3-5,9,12H,6-8H2,1-2H3,(H,15,17)/t9-,12-/m0/s1
NCI pathway
Reactome pathway
n/an/a 30n/an/an/an/an/an/a
University of Bologna
Curated by ChEMBL
Assay Description
Inhibitory activity against acetylcholinesterase in human erythrocytes
J Med Chem 44: 105-9 (2001)
BindingDB Entry DOI: 10.7270/Q2NG4RX2
Acetylcholinesterase
(Homo sapiens (Human))
BDBM10951
((2S,6R)-3-methyl-8-oxa-3-azatricyclo[7.4.0.0^{2,6}...)
Show SMILES [H][C@@]12CCN(C)[C@]1([H])c1cccc(OC(=O)NC)c1OC2 |r|
Show InChI InChI=1S/C14H18N2O3/c1-15-14(17)19-11-5-3-4-10-12-9(6-7-16(12)2)8-18-13(10)11/h3-5,9,12H,6-8H2,1-2H3,(H,15,17)/t9-,12-/m0/s1
NCI pathway
Reactome pathway
n/an/a 30n/an/an/an/an/an/a
University of Bologna
Curated by ChEMBL
Assay Description
Inhibitory activity against acetylcholinesterase in human erythrocytes
J Med Chem 44: 105-9 (2001)
BindingDB Entry DOI: 10.7270/Q2NG4RX2
Cholinesterase
(Homo sapiens (Human))
BDBM10951
((2S,6R)-3-methyl-8-oxa-3-azatricyclo[7.4.0.0^{2,6}...)
Show SMILES [H][C@@]12CCN(C)[C@]1([H])c1cccc(OC(=O)NC)c1OC2 |r|
Show InChI InChI=1S/C14H18N2O3/c1-15-14(17)19-11-5-3-4-10-12-9(6-7-16(12)2)8-18-13(10)11/h3-5,9,12H,6-8H2,1-2H3,(H,15,17)/t9-,12-/m0/s1
Reactome pathway
n/an/a 54n/an/an/an/an/an/a
University of Bologna
Curated by ChEMBL
Assay Description
Inhibitory activity against butyrylcholinesterase (BChE) in human erythrocyte
J Med Chem 44: 105-9 (2001)
BindingDB Entry DOI: 10.7270/Q2NG4RX2
Cholinesterase
(Homo sapiens (Human))
BDBM10951
((2S,6R)-3-methyl-8-oxa-3-azatricyclo[7.4.0.0^{2,6}...)
Show SMILES [H][C@@]12CCN(C)[C@]1([H])c1cccc(OC(=O)NC)c1OC2 |r|
Show InChI InChI=1S/C14H18N2O3/c1-15-14(17)19-11-5-3-4-10-12-9(6-7-16(12)2)8-18-13(10)11/h3-5,9,12H,6-8H2,1-2H3,(H,15,17)/t9-,12-/m0/s1
Reactome pathway
n/an/a 54n/an/an/an/an/an/a
University of Bologna
Curated by ChEMBL
Assay Description
Inhibitory activity against butyrylcholinesterase (BChE) in human erythrocyte
J Med Chem 44: 105-9 (2001)
BindingDB Entry DOI: 10.7270/Q2NG4RX2
Cholinesterase
(Homo sapiens (Human))
BDBM10951
((2S,6R)-3-methyl-8-oxa-3-azatricyclo[7.4.0.0^{2,6}...)
Show SMILES [H][C@@]12CCN(C)[C@]1([H])c1cccc(OC(=O)NC)c1OC2 |r|
Show InChI InChI=1S/C14H18N2O3/c1-15-14(17)19-11-5-3-4-10-12-9(6-7-16(12)2)8-18-13(10)11/h3-5,9,12H,6-8H2,1-2H3,(H,15,17)/t9-,12-/m0/s1
Reactome pathway
n/an/a 54n/an/an/an/an/an/a
University of Bologna
Curated by ChEMBL
Assay Description
Inhibitory activity against butyrylcholinesterase (BChE) in human erythrocyte
J Med Chem 44: 105-9 (2001)
BindingDB Entry DOI: 10.7270/Q2NG4RX2