BDBM109968 US8609678, 4-((2,6-difluorophenyl)(methyl)amino)-N-(7-(hydroxyamino)-7-oxoheptyl)benzamide [20]::US8609678, 7-(4-((2,6-difluorophenyl)(methyl)amino)benzylamino)-N-hydroxyheptanamide [24]
SMILES: CN(c1ccc(cc1)C(=O)NCCCCCCC(=O)NO)c1c(F)cccc1F
InChI Key: InChIKey=QYSDDGFAOULDRL-UHFFFAOYSA-N
Data: 4 IC50
Activity Spreadsheet -- Enzyme Inhibition Constant Data from BindingDB
Found 4 hits for monomerid = 109968
Trg + Lig
Ki
nM
ΔG°
kcal/mole
IC50
nM
Kd
nM
EC50/IC50
nM
koff
s-1
kon
M-1s-1
pHTemp
°C
Cereblon/Histone deacetylase 6
(Homo sapiens (Human))
BDBM109968
(US8609678, 4-((2,6-difluorophenyl)(methyl)amino)-N...)
Show SMILES CN(c1ccc(cc1)C(=O)NCCCCCCC(=O)NO)c1c(F)cccc1F
Show InChI InChI=1S/C21H25F2N3O3/c1-26(20-17(22)7-6-8-18(20)23)16-12-10-15(11-13-16)21(28)24-14-5-3-2-4-9-19(27)25-29/h6-8,10-13,29H,2-5,9,14H2,1H3,(H,24,28)(H,25,27)
NCI pathway
Reactome pathway
US Patent
n/an/a 2n/an/an/an/a7.4n/a
Acetylon Pharmaceuticals
US Patent
Assay Description
Compounds for testing were diluted in DMSO to 50 fold the final concentration and a ten point three fold dilution series was made. The compounds were...
US Patent US8609678 (2013)
BindingDB Entry DOI: 10.7270/Q25M64BS
Cereblon/Histone deacetylase 6
(Homo sapiens (Human))
BDBM109968
(US8609678, 4-((2,6-difluorophenyl)(methyl)amino)-N...)
Show SMILES CN(c1ccc(cc1)C(=O)NCCCCCCC(=O)NO)c1c(F)cccc1F
Show InChI InChI=1S/C21H25F2N3O3/c1-26(20-17(22)7-6-8-18(20)23)16-12-10-15(11-13-16)21(28)24-14-5-3-2-4-9-19(27)25-29/h6-8,10-13,29H,2-5,9,14H2,1H3,(H,24,28)(H,25,27)
NCI pathway
Reactome pathway
US Patent
n/an/a 67n/an/an/an/a7.4n/a
Acetylon Pharmaceuticals
US Patent
Assay Description
Compounds for testing were diluted in DMSO to 50 fold the final concentration and a ten point three fold dilution series was made. The compounds were...
US Patent US8609678 (2013)
BindingDB Entry DOI: 10.7270/Q25M64BS
Cereblon/Histone deacetylase 6
(Homo sapiens (Human))
BDBM109968
(US8609678, 4-((2,6-difluorophenyl)(methyl)amino)-N...)
Show SMILES CN(c1ccc(cc1)C(=O)NCCCCCCC(=O)NO)c1c(F)cccc1F
Show InChI InChI=1S/C21H25F2N3O3/c1-26(20-17(22)7-6-8-18(20)23)16-12-10-15(11-13-16)21(28)24-14-5-3-2-4-9-19(27)25-29/h6-8,10-13,29H,2-5,9,14H2,1H3,(H,24,28)(H,25,27)
NCI pathway
Reactome pathway
US Patent
n/an/a 17n/an/an/an/a7.4n/a
Acetylon Pharmaceuticals
US Patent
Assay Description
Compounds for testing were diluted in DMSO to 50 fold the final concentration and a ten point three fold dilution series was made. The compounds were...
US Patent US8609678 (2013)
BindingDB Entry DOI: 10.7270/Q25M64BS
Cereblon/Histone deacetylase 6
(Homo sapiens (Human))
BDBM109968
(US8609678, 4-((2,6-difluorophenyl)(methyl)amino)-N...)
Show SMILES CN(c1ccc(cc1)C(=O)NCCCCCCC(=O)NO)c1c(F)cccc1F
Show InChI InChI=1S/C21H25F2N3O3/c1-26(20-17(22)7-6-8-18(20)23)16-12-10-15(11-13-16)21(28)24-14-5-3-2-4-9-19(27)25-29/h6-8,10-13,29H,2-5,9,14H2,1H3,(H,24,28)(H,25,27)
NCI pathway
Reactome pathway
US Patent
n/an/a 121n/an/an/an/a7.4n/a
Acetylon Pharmaceuticals
US Patent
Assay Description
Compounds for testing were diluted in DMSO to 50 fold the final concentration and a ten point three fold dilution series was made. The compounds were...
US Patent US8609678 (2013)
BindingDB Entry DOI: 10.7270/Q25M64BS