null
SMILES: Cc1ccc(cc1)C1=NN(C(C1)c1ccco1)C(N)=S
InChI Key: InChIKey=NNSLQCQCMFBQHJ-UHFFFAOYSA-N
Activity Spreadsheet -- Enzyme Inhibition Constant Data from BindingDB
Found 2 hits for monomerid = 11006
Trg + Lig
Ki
nM
ΔG°
kcal/mole
IC50
nM
Kd
nM
EC50/IC50
nM
koff
s-1
kon
M-1s-1
pHTemp
°C
Amine oxidase [flavin-containing] A
(Bos taurus)
BDBM11006
(1-thiocarbamoyl-3,5-diaryl-4,5-dihydro-(1H)-pyrazo...)
Show SMILES Cc1ccc(cc1)C1=NN(C(C1)c1ccco1)C(N)=S |t:8|
Show InChI InChI=1S/C15H15N3OS/c1-10-4-6-11(7-5-10)12-9-13(14-3-2-8-19-14)18(17-12)15(16)20/h2-8,13H,9H2,1H3,(H2,16,20)
Reactome pathway
4 -11.9n/an/an/an/an/a7.438
Universita degli Studi di Roma La Sapienza
Assay Description
MAO A and MAO B activities were determined spectrophotometrically using kynuramine as substrates. Fluorimetric measurements were recorded with a Perk...
J Med Chem 48: 7113-22 (2005)
Article DOI: 10.1021/jm040903t
BindingDB Entry DOI: 10.7270/Q2JH3JDW
Amine oxidase [flavin-containing] B
(Bos taurus)
BDBM11006
(1-thiocarbamoyl-3,5-diaryl-4,5-dihydro-(1H)-pyrazo...)
Show SMILES Cc1ccc(cc1)C1=NN(C(C1)c1ccco1)C(N)=S |t:8|
Show InChI InChI=1S/C15H15N3OS/c1-10-4-6-11(7-5-10)12-9-13(14-3-2-8-19-14)18(17-12)15(16)20/h2-8,13H,9H2,1H3,(H2,16,20)
Reactome pathway
170 -9.63n/an/an/an/an/a7.438
Universita degli Studi di Roma La Sapienza
Assay Description
MAO A and MAO B activities were determined spectrophotometrically using kynuramine as substrates. Fluorimetric measurements were recorded with a Perk...
J Med Chem 48: 7113-22 (2005)
Article DOI: 10.1021/jm040903t
BindingDB Entry DOI: 10.7270/Q2JH3JDW