BDBM110185 Z-FF-FMK::benzyl N-[1-[(4-fluoro-3-oxo-1-phenylbutan-2-yl)amino]-1-oxo-3-phenylpropan-2-yl]carbamate
SMILES: FCC(=O)C(Cc1ccccc1)NC(=O)C(Cc1ccccc1)NC(=O)OCc1ccccc1
InChI Key: InChIKey=CAILNONEKASNSH-UHFFFAOYSA-N
Data: 4 IC50
Activity Spreadsheet -- Enzyme Inhibition Constant Data from BindingDB
Found 4 hits for monomerid = 110185
Trg + Lig
Ki
nM
ΔG°
kcal/mole
IC50
nM
Kd
nM
EC50/IC50
nM
koff
s-1
kon
M-1s-1
pHTemp
°C
Calpain1
(Homo sapiens (Human))
BDBM110185
(Z-FF-FMK | benzyl N-[1-[(4-fluoro-3-oxo-1-phenylbu...)
Show SMILES FCC(=O)C(Cc1ccccc1)NC(=O)C(Cc1ccccc1)NC(=O)OCc1ccccc1
Show InChI InChI=1S/C27H27FN2O4/c28-18-25(31)23(16-20-10-4-1-5-11-20)29-26(32)24(17-21-12-6-2-7-13-21)30-27(33)34-19-22-14-8-3-9-15-22/h1-15,23-24H,16-19H2,(H,29,32)(H,30,33)
Reactome pathway
n/an/a 397n/an/an/an/a7.525
Ewha Womans University, Seoul 120-750, Republic of Korea.
Assay Description
Inhibition of µ-calpain was assayed in the reaction buffer (50 mM Tris-HCl, 50 mM NaCl, 1 mM EDTA, 1 mM EGTA and 5 mM β-mercaptoethanol, pH...
Bioorg Chem 51: 24-30 (2013)
Article DOI: 10.1016/j.bioorg.2013.09.002
BindingDB Entry DOI: 10.7270/Q2NP233R
Procathepsin L
(Homo sapiens (Human))
BDBM110185
(Z-FF-FMK | benzyl N-[1-[(4-fluoro-3-oxo-1-phenylbu...)
Show SMILES FCC(=O)C(Cc1ccccc1)NC(=O)C(Cc1ccccc1)NC(=O)OCc1ccccc1
Show InChI InChI=1S/C27H27FN2O4/c28-18-25(31)23(16-20-10-4-1-5-11-20)29-26(32)24(17-21-12-6-2-7-13-21)30-27(33)34-19-22-14-8-3-9-15-22/h1-15,23-24H,16-19H2,(H,29,32)(H,30,33)
Reactome pathway
n/an/a 5.70n/an/an/an/a5.537
Ewha Womans University, Seoul 120-750, Republic of Korea.
Assay Description
Inhibition of cathepsin L was assayed in reaction buffer (0.1M NaOAc-HCl, 1 mM EDTA, 0.1% β-mercaptoethanol, pH 5.5) containing 20 µM subst...
Bioorg Chem 51: 24-30 (2013)
Article DOI: 10.1016/j.bioorg.2013.09.002
BindingDB Entry DOI: 10.7270/Q2NP233R
Cathepsin B
(Homo sapiens (Human))
BDBM110185
(Z-FF-FMK | benzyl N-[1-[(4-fluoro-3-oxo-1-phenylbu...)
Show SMILES FCC(=O)C(Cc1ccccc1)NC(=O)C(Cc1ccccc1)NC(=O)OCc1ccccc1
Show InChI InChI=1S/C27H27FN2O4/c28-18-25(31)23(16-20-10-4-1-5-11-20)29-26(32)24(17-21-12-6-2-7-13-21)30-27(33)34-19-22-14-8-3-9-15-22/h1-15,23-24H,16-19H2,(H,29,32)(H,30,33)
Reactome pathway
n/an/a 65.6n/an/an/an/a5.537
Ewha Womans University, Seoul 120-750, Republic of Korea.
Assay Description
Inhibition of cathepsin B was assayed in reaction buffer (50 mM NaOAc-HCl, 2 mM dithiothreitol, 2 mM EDTA, pH 5.5) containing 20 µM substrate an...
Bioorg Chem 51: 24-30 (2013)
Article DOI: 10.1016/j.bioorg.2013.09.002
BindingDB Entry DOI: 10.7270/Q2NP233R
Calpain-2 (m-Calpain)
(Homo sapiens (Human))
BDBM110185
(Z-FF-FMK | benzyl N-[1-[(4-fluoro-3-oxo-1-phenylbu...)
Show SMILES FCC(=O)C(Cc1ccccc1)NC(=O)C(Cc1ccccc1)NC(=O)OCc1ccccc1
Show InChI InChI=1S/C27H27FN2O4/c28-18-25(31)23(16-20-10-4-1-5-11-20)29-26(32)24(17-21-12-6-2-7-13-21)30-27(33)34-19-22-14-8-3-9-15-22/h1-15,23-24H,16-19H2,(H,29,32)(H,30,33)
n/an/a 418n/an/an/an/a7.525
Ewha Womans University, Seoul 120-750, Republic of Korea.
Assay Description
Inhibition of m-calpain was assayed in the reaction buffer (50 mM Tris-HCl, 100 mM NaCl, 5 mM β-mercaptoethanol, and 1 mM EDTA, pH 7.5) with 50 ...
Bioorg Chem 51: 24-30 (2013)
Article DOI: 10.1016/j.bioorg.2013.09.002
BindingDB Entry DOI: 10.7270/Q2NP233R