BDBM110195 1-(3,5-Dihydroxyphenyl)-3-phenylpropenone (22)
SMILES: Oc1cc(O)cc(c1)C(=O)\C=C\c1ccccc1
InChI Key: InChIKey=ZQVRRJFECPRWDA-VOTSOKGWSA-N
Data: 4 IC50
Activity Spreadsheet -- Enzyme Inhibition Constant Data from BindingDB
Found 4 hits for monomerid = 110195
Trg + Lig
Ki
nM
ΔG°
kcal/mole
IC50
nM
Kd
nM
EC50/IC50
nM
koff
s-1
kon
M-1s-1
pHTemp
°C
Calpain1
(Homo sapiens (Human))
BDBM110195
(1-(3,5-Dihydroxyphenyl)-3-phenylpropenone (22))
Show SMILES Oc1cc(O)cc(c1)C(=O)\C=C\c1ccccc1
Show InChI InChI=1S/C15H12O3/c16-13-8-12(9-14(17)10-13)15(18)7-6-11-4-2-1-3-5-11/h1-10,16-17H/b7-6+
Reactome pathway
n/an/a>1.00E+5n/an/an/an/a7.525
Ewha Womans University, Seoul 120-750, Republic of Korea.
Assay Description
Inhibition of µ-calpain was assayed in the reaction buffer (50 mM Tris-HCl, 50 mM NaCl, 1 mM EDTA, 1 mM EGTA and 5 mM β-mercaptoethanol, pH...
Bioorg Chem 51: 24-30 (2013)
Article DOI: 10.1016/j.bioorg.2013.09.002
BindingDB Entry DOI: 10.7270/Q2NP233R
Procathepsin L
(Homo sapiens (Human))
BDBM110195
(1-(3,5-Dihydroxyphenyl)-3-phenylpropenone (22))
Show SMILES Oc1cc(O)cc(c1)C(=O)\C=C\c1ccccc1
Show InChI InChI=1S/C15H12O3/c16-13-8-12(9-14(17)10-13)15(18)7-6-11-4-2-1-3-5-11/h1-10,16-17H/b7-6+
Reactome pathway
n/an/a>1.00E+5n/an/an/an/a5.537
Ewha Womans University, Seoul 120-750, Republic of Korea.
Assay Description
Inhibition of cathepsin L was assayed in reaction buffer (0.1M NaOAc-HCl, 1 mM EDTA, 0.1% β-mercaptoethanol, pH 5.5) containing 20 µM subst...
Bioorg Chem 51: 24-30 (2013)
Article DOI: 10.1016/j.bioorg.2013.09.002
BindingDB Entry DOI: 10.7270/Q2NP233R
Cathepsin B
(Homo sapiens (Human))
BDBM110195
(1-(3,5-Dihydroxyphenyl)-3-phenylpropenone (22))
Show SMILES Oc1cc(O)cc(c1)C(=O)\C=C\c1ccccc1
Show InChI InChI=1S/C15H12O3/c16-13-8-12(9-14(17)10-13)15(18)7-6-11-4-2-1-3-5-11/h1-10,16-17H/b7-6+
Reactome pathway
n/an/a>1.00E+5n/an/an/an/a5.537
Ewha Womans University, Seoul 120-750, Republic of Korea.
Assay Description
Inhibition of cathepsin B was assayed in reaction buffer (50 mM NaOAc-HCl, 2 mM dithiothreitol, 2 mM EDTA, pH 5.5) containing 20 µM substrate an...
Bioorg Chem 51: 24-30 (2013)
Article DOI: 10.1016/j.bioorg.2013.09.002
BindingDB Entry DOI: 10.7270/Q2NP233R
Calpain-2 (m-Calpain)
(Homo sapiens (Human))
BDBM110195
(1-(3,5-Dihydroxyphenyl)-3-phenylpropenone (22))
Show SMILES Oc1cc(O)cc(c1)C(=O)\C=C\c1ccccc1
Show InChI InChI=1S/C15H12O3/c16-13-8-12(9-14(17)10-13)15(18)7-6-11-4-2-1-3-5-11/h1-10,16-17H/b7-6+
n/an/a>1.00E+5n/an/an/an/a7.525
Ewha Womans University, Seoul 120-750, Republic of Korea.
Assay Description
Inhibition of m-calpain was assayed in the reaction buffer (50 mM Tris-HCl, 100 mM NaCl, 5 mM β-mercaptoethanol, and 1 mM EDTA, pH 7.5) with 50 ...
Bioorg Chem 51: 24-30 (2013)
Article DOI: 10.1016/j.bioorg.2013.09.002
BindingDB Entry DOI: 10.7270/Q2NP233R