null
SMILES: CCCCCCn1cc(ccc1=O)C(=O)c1cc(O)ccc1O
InChI Key: InChIKey=UZYOJEDJUONBDU-UHFFFAOYSA-N
Activity Spreadsheet -- Enzyme Inhibition Constant Data from BindingDB
Found 1 hit for monomerid = 110209
Trg + Lig
Ki
nM
ΔG°
kcal/mole
IC50
nM
Kd
nM
EC50/IC50
nM
koff
s-1
kon
M-1s-1
pHTemp
°C
Tyrosine-protein kinase CSK
(Homo sapiens (Human))
BDBM110209
(5-(2,5-Dihydroxybenzoyl)-1-hexylpyridin-2(1H)-one ...)
Show SMILES CCCCCCn1cc(ccc1=O)C(=O)c1cc(O)ccc1O
Show InChI InChI=1S/C18H21NO4/c1-2-3-4-5-10-19-12-13(6-9-17(19)22)18(23)15-11-14(20)7-8-16(15)21/h6-9,11-12,20-21H,2-5,10H2,1H3
NCI pathway
Reactome pathway
n/an/a 2.21E+4n/an/an/an/a7.525
University of Delhi, Delhi 110007, India
Assay Description
The kinase reaction was initiated with the incubation of the 2.5 µL of the reaction cocktail (0.7 nM of His6-Src kinase domain in kinase buffer)...
Bioorg Chem 53: 75-82 (2014)
Article DOI: 10.1016/j.bioorg.2014.02.001
BindingDB Entry DOI: 10.7270/Q2HX1BBK