BDBM110360 US8613914, 128::US9206232, 128
SMILES: CC(C)N1CCCC[C@H]1C(=O)N[C@H](C(=O)N[C@H](C(=O)N1C[C@]2(C[C@H]1C(=O)N[C@@]1(C[C@H]1C=C)C(=O)NS(=O)(=O)N1CCCC1)C(C)(C)C21CCC1)C1(C)CCOCC1)C(C)(C)C
InChI Key: InChIKey=MOJHZLPPVIASCY-JEFJQDSISA-N
Data: 2 IC50
Activity Spreadsheet -- Enzyme Inhibition Constant Data from BindingDB
Found 2 hits for monomerid = 110360
Trg + Lig
Ki
nM
ΔG°
kcal/mole
IC50
nM
Kd
nM
EC50/IC50
nM
koff
s-1
kon
M-1s-1
pHTemp
°C
HCV NS3-NS4A Serine Proteinase
(Hepatitis C virus (HCV genotype 1a, isolate H))
BDBM110360
(US8613914, 128 | US9206232, 128)
Show SMILES CC(C)N1CCCC[C@H]1C(=O)N[C@H](C(=O)N[C@H](C(=O)N1C[C@]2(C[C@H]1C(=O)N[C@@]1(C[C@H]1C=C)C(=O)NS(=O)(=O)N1CCCC1)C(C)(C)C21CCC1)C1(C)CCOCC1)C(C)(C)C |r|
Show InChI InChI=1S/C45H73N7O8S/c1-10-30-26-45(30,39(57)49-61(58,59)50-21-13-14-22-50)48-36(54)32-27-44(41(7,8)43(44)17-15-18-43)28-52(32)38(56)34(42(9)19-24-60-25-20-42)47-37(55)33(40(4,5)6)46-35(53)31-16-11-12-23-51(31)29(2)3/h10,29-34H,1,11-28H2,2-9H3,(H,46,53)(H,47,55)(H,48,54)(H,49,57)/t30-,31+,32+,33-,34-,44-,45-/m1/s1
US Patent
n/an/a 1.40n/an/an/an/an/an/a
Novartis AG
US Patent
Assay Description
The inhibitory activity of certain compounds of Table A against HCV NS3-4A serine protease is determined in a homogenous assay using the full-length ...
US Patent US9206232 (2015)
BindingDB Entry DOI: 10.7270/Q2M0447H
NS3/4A protein
(Hepatitis C virus)
BDBM110360
(US8613914, 128 | US9206232, 128)
Show SMILES CC(C)N1CCCC[C@H]1C(=O)N[C@H](C(=O)N[C@H](C(=O)N1C[C@]2(C[C@H]1C(=O)N[C@@]1(C[C@H]1C=C)C(=O)NS(=O)(=O)N1CCCC1)C(C)(C)C21CCC1)C1(C)CCOCC1)C(C)(C)C |r|
Show InChI InChI=1S/C45H73N7O8S/c1-10-30-26-45(30,39(57)49-61(58,59)50-21-13-14-22-50)48-36(54)32-27-44(41(7,8)43(44)17-15-18-43)28-52(32)38(56)34(42(9)19-24-60-25-20-42)47-37(55)33(40(4,5)6)46-35(53)31-16-11-12-23-51(31)29(2)3/h10,29-34H,1,11-28H2,2-9H3,(H,46,53)(H,47,55)(H,48,54)(H,49,57)/t30-,31+,32+,33-,34-,44-,45-/m1/s1
US Patent
n/an/a 1.40n/an/an/an/an/an/a
Novartis AG
US Patent
Assay Description
The inhibitory activity of certain compounds against HCV NS3-4A serine protease is determined in a homogenous assay using the full-length NS3-4A prot...
US Patent US8613914 (2013)
BindingDB Entry DOI: 10.7270/Q28C9TWW