BDBM110383 US8613914, 157::US9206232, 157
SMILES: CCN(CC)S(=O)(=O)NC(=O)[C@]1(C[C@H]1C=C)NC(=O)[C@@H]1C[C@@]2(CN1C(=O)[C@@H](NC(=O)[C@@H](NC(=O)[C@@H]1CCCN1CC)C1(C)CCOCC1)C1(C)CCCCC1)C(C)(C)C21CCC1
InChI Key: InChIKey=OIHIJLNMNDCCIY-ROLGRHSRSA-N
Data: 2 IC50
Activity Spreadsheet -- Enzyme Inhibition Constant Data from BindingDB
Found 2 hits for monomerid = 110383
Trg + Lig
Ki
nM
ΔG°
kcal/mole
IC50
nM
Kd
nM
EC50/IC50
nM
koff
s-1
kon
M-1s-1
pHTemp
°C
HCV NS3-NS4A Serine Proteinase
(Hepatitis C virus (HCV genotype 1a, isolate H))
BDBM110383
(US8613914, 157 | US9206232, 157)
Show SMILES CCN(CC)S(=O)(=O)NC(=O)[C@]1(C[C@H]1C=C)NC(=O)[C@@H]1C[C@@]2(CN1C(=O)[C@@H](NC(=O)[C@@H](NC(=O)[C@@H]1CCCN1CC)C1(C)CCOCC1)C1(C)CCCCC1)C(C)(C)C21CCC1 |r|
Show InChI InChI=1S/C46H75N7O8S/c1-9-31-28-46(31,40(58)50-62(59,60)52(11-3)12-4)49-37(55)33-29-45(41(5,6)44(45)21-17-22-44)30-53(33)39(57)35(42(7)19-14-13-15-20-42)48-38(56)34(43(8)23-26-61-27-24-43)47-36(54)32-18-16-25-51(32)10-2/h9,31-35H,1,10-30H2,2-8H3,(H,47,54)(H,48,56)(H,49,55)(H,50,58)/t31-,32+,33+,34-,35-,45-,46-/m1/s1
US Patent
n/an/a 1n/an/an/an/an/an/a
Novartis AG
US Patent
Assay Description
The inhibitory activity of certain compounds of Table A against HCV NS3-4A serine protease is determined in a homogenous assay using the full-length ...
US Patent US9206232 (2015)
BindingDB Entry DOI: 10.7270/Q2M0447H
NS3/4A protein
(Hepatitis C virus)
BDBM110383
(US8613914, 157 | US9206232, 157)
Show SMILES CCN(CC)S(=O)(=O)NC(=O)[C@]1(C[C@H]1C=C)NC(=O)[C@@H]1C[C@@]2(CN1C(=O)[C@@H](NC(=O)[C@@H](NC(=O)[C@@H]1CCCN1CC)C1(C)CCOCC1)C1(C)CCCCC1)C(C)(C)C21CCC1 |r|
Show InChI InChI=1S/C46H75N7O8S/c1-9-31-28-46(31,40(58)50-62(59,60)52(11-3)12-4)49-37(55)33-29-45(41(5,6)44(45)21-17-22-44)30-53(33)39(57)35(42(7)19-14-13-15-20-42)48-38(56)34(43(8)23-26-61-27-24-43)47-36(54)32-18-16-25-51(32)10-2/h9,31-35H,1,10-30H2,2-8H3,(H,47,54)(H,48,56)(H,49,55)(H,50,58)/t31-,32+,33+,34-,35-,45-,46-/m1/s1
US Patent
n/an/a 1n/an/an/an/an/an/a
Novartis AG
US Patent
Assay Description
The inhibitory activity of certain compounds against HCV NS3-4A serine protease is determined in a homogenous assay using the full-length NS3-4A prot...
US Patent US8613914 (2013)
BindingDB Entry DOI: 10.7270/Q28C9TWW