BDBM110388 US8613914, 162::US9206232, 162
SMILES: CC(C)N1CCCC[C@H]1C(=O)N[C@@H](C1CCCCC1)C(=O)N[C@H](C(=O)N1C[C@]2(C[C@H]1C(=O)N[C@@]1(C[C@H]1C=C)C(=O)NS(=O)(=O)N(C)C)C(C)(C)C21CCC1)C(C)(C)C
InChI Key: InChIKey=LOYIQGBTNJFCIL-ZPWJQIKTSA-N
Data: 3 IC50
Activity Spreadsheet -- Enzyme Inhibition Constant Data from BindingDB
Found 3 hits for monomerid = 110388
Trg + Lig
Ki
nM
ΔG°
kcal/mole
IC50
nM
Kd
nM
EC50/IC50
nM
koff
s-1
kon
M-1s-1
pHTemp
°C
Genome polyprotein
(Hepatitis C virus)
BDBM110388
(US8613914, 162 | US9206232, 162)
Show SMILES CC(C)N1CCCC[C@H]1C(=O)N[C@@H](C1CCCCC1)C(=O)N[C@H](C(=O)N1C[C@]2(C[C@H]1C(=O)N[C@@]1(C[C@H]1C=C)C(=O)NS(=O)(=O)N(C)C)C(C)(C)C21CCC1)C(C)(C)C |r|
Show InChI InChI=1S/C43H71N7O7S/c1-11-29-24-43(29,38(55)47-58(56,57)48(9)10)46-35(52)31-25-42(40(7,8)41(42)21-17-22-41)26-50(31)37(54)33(39(4,5)6)45-36(53)32(28-18-13-12-14-19-28)44-34(51)30-20-15-16-23-49(30)27(2)3/h11,27-33H,1,12-26H2,2-10H3,(H,44,51)(H,45,53)(H,46,52)(H,47,55)/t29-,30+,31+,32+,33-,42-,43-/m1/s1
US Patent
n/an/a 0.900n/an/an/an/an/an/a
Novartis AG
US Patent
Assay Description
The inhibitory activity of certain compounds against HCV NS3-4A serine protease is determined in a homogenous assay using the full-length NS3-4A prot...
US Patent US8613914 (2013)
BindingDB Entry DOI: 10.7270/Q28C9TWW
Genome polyprotein
(Hepatitis C virus (HCV genotype 1a, isolate H))
BDBM110388
(US8613914, 162 | US9206232, 162)
Show SMILES CC(C)N1CCCC[C@H]1C(=O)N[C@@H](C1CCCCC1)C(=O)N[C@H](C(=O)N1C[C@]2(C[C@H]1C(=O)N[C@@]1(C[C@H]1C=C)C(=O)NS(=O)(=O)N(C)C)C(C)(C)C21CCC1)C(C)(C)C |r|
Show InChI InChI=1S/C43H71N7O7S/c1-11-29-24-43(29,38(55)47-58(56,57)48(9)10)46-35(52)31-25-42(40(7,8)41(42)21-17-22-41)26-50(31)37(54)33(39(4,5)6)45-36(53)32(28-18-13-12-14-19-28)44-34(51)30-20-15-16-23-49(30)27(2)3/h11,27-33H,1,12-26H2,2-10H3,(H,44,51)(H,45,53)(H,46,52)(H,47,55)/t29-,30+,31+,32+,33-,42-,43-/m1/s1
US Patent
n/an/a 0.900n/an/an/an/an/an/a
Novartis AG
US Patent
Assay Description
The inhibitory activity of certain compounds of Table A against HCV NS3-4A serine protease is determined in a homogenous assay using the full-length ...
US Patent US9206232 (2015)
BindingDB Entry DOI: 10.7270/Q2M0447H
Genome polyprotein
(Hepatitis C virus (HCV genotype 1a, isolate H))
BDBM110388
(US8613914, 162 | US9206232, 162)
Show SMILES CC(C)N1CCCC[C@H]1C(=O)N[C@@H](C1CCCCC1)C(=O)N[C@H](C(=O)N1C[C@]2(C[C@H]1C(=O)N[C@@]1(C[C@H]1C=C)C(=O)NS(=O)(=O)N(C)C)C(C)(C)C21CCC1)C(C)(C)C |r|
Show InChI InChI=1S/C43H71N7O7S/c1-11-29-24-43(29,38(55)47-58(56,57)48(9)10)46-35(52)31-25-42(40(7,8)41(42)21-17-22-41)26-50(31)37(54)33(39(4,5)6)45-36(53)32(28-18-13-12-14-19-28)44-34(51)30-20-15-16-23-49(30)27(2)3/h11,27-33H,1,12-26H2,2-10H3,(H,44,51)(H,45,53)(H,46,52)(H,47,55)/t29-,30+,31+,32+,33-,42-,43-/m1/s1
US Patent
n/an/a 0.800n/an/an/an/an/an/a
Novartis AG
US Patent
Assay Description
The inhibitory activity of certain compounds of Table A against HCV NS3-4A serine protease is determined in a homogenous assay using the full-length ...
US Patent US9206232 (2015)
BindingDB Entry DOI: 10.7270/Q2M0447H