BDBM1104 (4R,5R,6R)-Tetrahydro-1,3-bis[(3-(N-hydroxycarboximidamide)phenyl)methyl]-5-hydroxy-4-(2-(4-fluorophenyl)ethyl)-6-(4-fluorophenylmethyl)-2(1H)-pyrimidinone::3-{[(4R,5R,6R)-6-[2-(4-fluorophenyl)ethyl]-4-[(4-fluorophenyl)methyl]-5-hydroxy-3-{[3-(N'-hydroxycarbamimidoyl)phenyl]methyl}-2-oxo-1,3-diazinan-1-yl]methyl}-N'-hydroxybenzene-1-carboximidamide::Tetrahydropyrimidinone deriv. 61
SMILES: ONC(=N)c1cccc(CN2[C@H](CCc3ccc(F)cc3)[C@@H](O)[C@@H](Cc3ccc(F)cc3)N(Cc3cccc(c3)C(=N)NO)C2=O)c1
InChI Key: InChIKey=GNPYXBMOZFIQNG-XWHIBYANSA-N
Data: 1 KI
Activity Spreadsheet -- Enzyme Inhibition Constant Data from BindingDB
Found 1 hit for monomerid = 1104
Trg + Lig
Ki
nM
ΔG°
kcal/mole
IC50
nM
Kd
nM
EC50/IC50
nM
koff
s-1
kon
M-1s-1
pHTemp
°C
HIV-1 Protease
(Human immunodeficiency virus type 1)
BDBM1104
((4R,5R,6R)-Tetrahydro-1,3-bis[(3-(N-hydroxycarboxi...)
Show SMILES ONC(=N)c1cccc(CN2[C@H](CCc3ccc(F)cc3)[C@@H](O)[C@@H](Cc3ccc(F)cc3)N(Cc3cccc(c3)C(=N)NO)C2=O)c1 |r|
Show InChI InChI=1S/C35H36F2N6O4/c36-28-12-7-22(8-13-28)11-16-30-32(44)31(19-23-9-14-29(37)15-10-23)43(21-25-4-2-6-27(18-25)34(39)41-47)35(45)42(30)20-24-3-1-5-26(17-24)33(38)40-46/h1-10,12-15,17-18,30-32,44,46-47H,11,16,19-21H2,(H2,38,40)(H2,39,41)/t30-,31-,32-/m1/s1
0.0200 -15.2n/an/an/an/an/a5.537
DuPont Pharmaceuticals Company
Assay Description
Inhibition of HIV protease was measured by assay of the cleavage of a fluorescent peptide substrate. The fluorescent product (2-aminobenzoyl-Ala-Thr-...
J Med Chem 42: 135-52 (1999)
Article DOI: 10.1021/jm9803626
BindingDB Entry DOI: 10.7270/Q28050S9