BDBM11045 N-(2-chloro-4-sulfamoylphenyl)-3-sulfanylpropanamide::reduced monomeric thio of compound 2c::reduced thio H2c
SMILES: NS(=O)(=O)c1ccc(NC(=O)CCS)c(Cl)c1
InChI Key: InChIKey=FHYWPFZZUNPUTE-UHFFFAOYSA-N
Data: 3 KI
Activity Spreadsheet -- Enzyme Inhibition Constant Data from BindingDB
Found 3 hits for monomerid = 11045
Trg + Lig
Ki
nM
ΔG°
kcal/mole
IC50
nM
Kd
nM
EC50/IC50
nM
koff
s-1
kon
M-1s-1
pHTemp
°C
Carbonic anhydrase 9
(Homo sapiens (Human))
BDBM11045
(N-(2-chloro-4-sulfamoylphenyl)-3-sulfanylpropanami...)
Show SMILES NS(=O)(=O)c1ccc(NC(=O)CCS)c(Cl)c1
Show InChI InChI=1S/C9H11ClN2O3S2/c10-7-5-6(17(11,14)15)1-2-8(7)12-9(13)3-4-16/h1-2,5,16H,3-4H2,(H,12,13)(H2,11,14,15)
NCI pathway
Reactome pathway
8.70n/an/an/an/an/an/an/an/a
Istituto di Biostrutture e Bioimmagini-CNR
Assay Description
An Applied Photophysics stopped-flow instrument has been used for assaying the CA-catalyzed CO2 hydration activity. Phenol red has been used as indic...
J Med Chem 49: 5544-51 (2006)
Article DOI: 10.1021/jm060531j
BindingDB Entry DOI: 10.7270/Q21J9805
Carbonic anhydrase 2
(Homo sapiens (Human))
BDBM11045
(N-(2-chloro-4-sulfamoylphenyl)-3-sulfanylpropanami...)
Show SMILES NS(=O)(=O)c1ccc(NC(=O)CCS)c(Cl)c1
Show InChI InChI=1S/C9H11ClN2O3S2/c10-7-5-6(17(11,14)15)1-2-8(7)12-9(13)3-4-16/h1-2,5,16H,3-4H2,(H,12,13)(H2,11,14,15)
Reactome pathway
8.90n/an/an/an/an/an/an/an/a
Istituto di Biostrutture e Bioimmagini-CNR
Assay Description
An Applied Photophysics stopped-flow instrument has been used for assaying the CA-catalyzed CO2 hydration activity. Phenol red has been used as indic...
J Med Chem 49: 5544-51 (2006)
Article DOI: 10.1021/jm060531j
BindingDB Entry DOI: 10.7270/Q21J9805
Carbonic anhydrase 1
(Homo sapiens (Human))
BDBM11045
(N-(2-chloro-4-sulfamoylphenyl)-3-sulfanylpropanami...)
Show SMILES NS(=O)(=O)c1ccc(NC(=O)CCS)c(Cl)c1
Show InChI InChI=1S/C9H11ClN2O3S2/c10-7-5-6(17(11,14)15)1-2-8(7)12-9(13)3-4-16/h1-2,5,16H,3-4H2,(H,12,13)(H2,11,14,15)
NCI pathway
Reactome pathway
10 -10.8n/an/an/an/an/a7.522
Istituto di Biostrutture e Bioimmagini-CNR
Assay Description
An Applied Photophysics stopped-flow instrument has been used for assaying the CA-catalyzed CO2 hydration activity. Phenol red has been used as indic...
J Med Chem 49: 5544-51 (2006)
Article DOI: 10.1021/jm060531j
BindingDB Entry DOI: 10.7270/Q21J9805