BDBM110711 US8614206, 166
SMILES: CN=C(C(NC(=O)c1nc(sc1N)-c1c(F)cccc1F)C=N)N1CC[C@H](N)CC(F)(F)C1
InChI Key: InChIKey=RXWWMTWJZMLSIP-NKUHCKNESA-N
Data: 1 KI
Activity Spreadsheet -- Enzyme Inhibition Constant Data from BindingDB
Found 1 hit for monomerid = 110711
Trg + Lig
Ki
nM
ΔG°
kcal/mole
IC50
nM
Kd
nM
EC50/IC50
nM
koff
s-1
kon
M-1s-1
pHTemp
°C
Serine/threonine-protein kinase pim-1
(Homo sapiens (Human))
BDBM110711
(US8614206, 166)
Show SMILES CN=C(C(NC(=O)c1nc(sc1N)-c1c(F)cccc1F)C=N)N1CC[C@H](N)CC(F)(F)C1 |r,w:1.0|
Show InChI InChI=1S/C20H23F4N7OS/c1-28-17(31-6-5-10(26)7-20(23,24)9-31)13(8-25)29-18(32)15-16(27)33-19(30-15)14-11(21)3-2-4-12(14)22/h2-4,8,10,13,25H,5-7,9,26-27H2,1H3,(H,29,32)/t10-,13?/m0/s1
US Patent
0.00600n/an/an/an/an/an/a7.2n/a
F. Hoffmann-La Roche AG
US Patent
Assay Description
PIM-1, -2, and -3 enzymes were generated as fusion proteins expressed in bacteria and purified by IMAC column chromatography (Sun, X., Chiu, J. F., a...
US Patent US8614206 (2013)
BindingDB Entry DOI: 10.7270/Q2W66JFG