BDBM110795 US8614206, 344
SMILES: N[C@H]1CCN(CC(F)(F)C1)c1c(NC(=O)c2nc(sc2N)-c2c(F)cccc2F)cnn1C1CC1
InChI Key: InChIKey=YYANEKLBNXOSKC-NSHDSACASA-N
Data: 1 KI
Activity Spreadsheet -- Enzyme Inhibition Constant Data from BindingDB
Found 1 hit for monomerid = 110795
Trg + Lig
Ki
nM
ΔG°
kcal/mole
IC50
nM
Kd
nM
EC50/IC50
nM
koff
s-1
kon
M-1s-1
pHTemp
°C
Serine/threonine-protein kinase pim-1
(Homo sapiens (Human))
BDBM110795
(US8614206, 344)
Show SMILES N[C@H]1CCN(CC(F)(F)C1)c1c(NC(=O)c2nc(sc2N)-c2c(F)cccc2F)cnn1C1CC1 |r|
Show InChI InChI=1S/C22H23F4N7OS/c23-13-2-1-3-14(24)16(13)20-31-17(18(28)35-20)19(34)30-15-9-29-33(12-4-5-12)21(15)32-7-6-11(27)8-22(25,26)10-32/h1-3,9,11-12H,4-8,10,27-28H2,(H,30,34)/t11-/m0/s1
US Patent
0.0100n/an/an/an/an/an/a7.2n/a
F. Hoffmann-La Roche AG
US Patent
Assay Description
PIM-1, -2, and -3 enzymes were generated as fusion proteins expressed in bacteria and purified by IMAC column chromatography (Sun, X., Chiu, J. F., a...
US Patent US8614206 (2013)
BindingDB Entry DOI: 10.7270/Q2W66JFG