BDBM111013 US8614253, 3-44::US9241942, 3-44::US9963434, Compound 3-44
SMILES: Oc1ccc(Br)cc1C=O
InChI Key: InChIKey=MKKSTJKBKNCMRV-UHFFFAOYSA-N
Data: 4 IC50
Activity Spreadsheet -- Enzyme Inhibition Constant Data from BindingDB
Found 4 hits for monomerid = 111013
Trg + Lig
Ki
nM
ΔG°
kcal/mole
IC50
nM
Kd
nM
EC50/IC50
nM
koff
s-1
kon
M-1s-1
pHTemp
°C
Serine/threonine-protein kinase/endoribonuclease IRE1
(Homo sapiens (Human))
BDBM111013
(US8614253, 3-44 | US9241942, 3-44 | US9963434, Com...)
Show SMILES Oc1ccc(Br)cc1C=O
Show InChI InChI=1S/C7H5BrO2/c8-6-1-2-7(10)5(3-6)4-9/h1-4,10H
Reactome pathway
US Patent
n/an/a 1.33E+3n/an/an/an/a7.530
MannKind Corporation
US Patent
Assay Description
IRE-1 alpha, T1 RNase, and RNase A assays carried out in vitro with several o-vanillin derivatives to demonstrate selectivity of the derivatives for ...
US Patent US8614253 (2013)
BindingDB Entry DOI: 10.7270/Q2RF5SQR
Lysosomal alpha-glucosidase
(Rattus norvegicus)
BDBM111013
(US8614253, 3-44 | US9241942, 3-44 | US9963434, Com...)
Show SMILES Oc1ccc(Br)cc1C=O
Show InChI InChI=1S/C7H5BrO2/c8-6-1-2-7(10)5(3-6)4-9/h1-4,10H
n/an/a 8.80E+3n/an/an/an/an/an/a
TBA
Assay Description
Inhibition of rat intestinal alpha-glucosidase using p-nitrophenyl- alpha-D-glucopyranoside as substrate preincubated for 5 min before addition of su...
Citation and Details
Article DOI: 10.1007/s00044-010-9377-3
BindingDB Entry DOI: 10.7270/Q2S75K6S
Serine/threonine-protein kinase/endoribonuclease IRE1
(Homo sapiens (Human))
BDBM111013
(US8614253, 3-44 | US9241942, 3-44 | US9963434, Com...)
Show SMILES Oc1ccc(Br)cc1C=O
Show InChI InChI=1S/C7H5BrO2/c8-6-1-2-7(10)5(3-6)4-9/h1-4,10H
Reactome pathway
US Patent
n/an/a 1.33E+3n/an/an/an/an/an/a
Novartis
Assay Description
A fusion protein comprising glutathione S transferase (GST) and human IRE-1α (GST-IRE-1α) was obtained from a 500 ml baculovirus-infected i...
J Med Chem 52: 3523-38 (2009)
BindingDB Entry DOI: 10.7270/Q2BK1FQR
Serine/threonine-protein kinase/endoribonuclease IRE1
(Homo sapiens (Human))
BDBM111013
(US8614253, 3-44 | US9241942, 3-44 | US9963434, Com...)
Show SMILES Oc1ccc(Br)cc1C=O
Show InChI InChI=1S/C7H5BrO2/c8-6-1-2-7(10)5(3-6)4-9/h1-4,10H
Reactome pathway
US Patent
n/an/a 1.33E+3n/an/an/an/a7.5n/a
MannKind Corporation
US Patent
Assay Description
A fusion protein comprising glutathione S transferase (GST) and human IRE-1α (GST-IRE-1α) was obtained from a 500 ml baculovirus-infected i...
US Patent US9241942 (2016)
BindingDB Entry DOI: 10.7270/Q25B0192