BDBM111129 US9695179, 124
SMILES: Clc1ccc2c(-c3ccccc3)c(Sc3nc4ccccc4s3)c(=O)[nH]c2c1
InChI Key: InChIKey=MJDAYFMZOCFVMV-UHFFFAOYSA-N
Data: 1 IC50
Activity Spreadsheet -- Enzyme Inhibition Constant Data from BindingDB
Found 1 hit for monomerid = 111129
Trg + Lig
Ki
nM
ΔG°
kcal/mole
IC50
nM
Kd
nM
EC50/IC50
nM
koff
s-1
kon
M-1s-1
pHTemp
°C
BRD4-BD1-BD2
(Homo sapiens (Human))
BDBM111129
(US9695179, 124)
Show SMILES Clc1ccc2c(-c3ccccc3)c(Sc3nc4ccccc4s3)c(=O)[nH]c2c1
Show InChI InChI=1S/C22H13ClN2OS2/c23-14-10-11-15-17(12-14)24-21(26)20(19(15)13-6-2-1-3-7-13)28-22-25-16-8-4-5-9-18(16)27-22/h1-12H,(H,24,26)
US Patent
n/an/a 1.73E+4n/an/an/an/an/a25
ConverGene LLC
US Patent
Assay Description
The interactions between test compounds and BRD4 protein containing both bromodomain 1 and bromodomain 2 were measured with human BRD4 protein with N...
US Patent US9695179 (2017)
BindingDB Entry DOI: 10.7270/Q21G0JF6