BDBM111217 US8614253, 26-4::US9241942, 26-4
SMILES: Oc1ccc(cc1C=O)-c1ccncc1
InChI Key: InChIKey=AWOHFBHWSKCQFQ-UHFFFAOYSA-N
Data: 2 IC50  1 EC50
Activity Spreadsheet -- Enzyme Inhibition Constant Data from BindingDB
Found 3 hits for monomerid = 111217
Trg + Lig
Ki
nM
ΔG°
kcal/mole
IC50
nM
Kd
nM
EC50/IC50
nM
koff
s-1
kon
M-1s-1
pHTemp
°C
Serine/threonine-protein kinase/endoribonuclease IRE1 Alpha
(Homo sapiens (Human))
BDBM111217
(US8614253, 26-4 | US9241942, 26-4)
Show SMILES Oc1ccc(cc1C=O)-c1ccncc1
Show InChI InChI=1S/C12H9NO2/c14-8-11-7-10(1-2-12(11)15)9-3-5-13-6-4-9/h1-8,15H
Reactome pathway
US Patent
n/an/a 147n/an/an/an/a7.530
MannKind Corporation
US Patent
Assay Description
IRE-1 alpha, T1 RNase, and RNase A assays carried out in vitro with several o-vanillin derivatives to demonstrate selectivity of the derivatives for ...
US Patent US8614253 (2013)
BindingDB Entry DOI: 10.7270/Q2RF5SQR
Serine/threonine-protein kinase/endoribonuclease IRE1 Alpha
(Homo sapiens (Human))
BDBM111217
(US8614253, 26-4 | US9241942, 26-4)
Show SMILES Oc1ccc(cc1C=O)-c1ccncc1
Show InChI InChI=1S/C12H9NO2/c14-8-11-7-10(1-2-12(11)15)9-3-5-13-6-4-9/h1-8,15H
Reactome pathway
US Patent
n/an/an/an/a 8.00E+4n/an/an/an/a
MannKind Corporation
US Patent
Assay Description
Initial cell-based XBP-1 mRNA splicing assays confirmed IRE-1α inhibition with several potent 5-bromo and 6 bromo o-vanillins. HEK293 cells were...
US Patent US9241942 (2016)
BindingDB Entry DOI: 10.7270/Q25B0192
Serine/threonine-protein kinase/endoribonuclease IRE1 Alpha
(Homo sapiens (Human))
BDBM111217
(US8614253, 26-4 | US9241942, 26-4)
Show SMILES Oc1ccc(cc1C=O)-c1ccncc1
Show InChI InChI=1S/C12H9NO2/c14-8-11-7-10(1-2-12(11)15)9-3-5-13-6-4-9/h1-8,15H
Reactome pathway
US Patent
n/an/a 147n/an/an/an/a7.5n/a
MannKind Corporation
US Patent
Assay Description
A fusion protein comprising glutathione S transferase (GST) and human IRE-1α (GST-IRE-1α) was obtained from a 500 ml baculovirus-infected i...
US Patent US9241942 (2016)
BindingDB Entry DOI: 10.7270/Q25B0192