BDBM11124 (2S)-1-[(2S)-2-amino-3-[4-(furan-2-yl)phenyl]propanoyl]pyrrolidine-2-carbonitrile::4-substituted phenylalanine cyano-(S)-pyrrolidine deriv. 11
SMILES: N[C@@H](Cc1ccc(cc1)-c1ccco1)C(=O)N1CCC[C@H]1C#N
InChI Key: InChIKey=SVCMTPJODOREKO-HOTGVXAUSA-N
Data: 1 KI
Activity Spreadsheet -- Enzyme Inhibition Constant Data from BindingDB
Found 1 hit for monomerid = 11124
Trg + Lig
Ki
nM
ΔG°
kcal/mole
IC50
nM
Kd
nM
EC50/IC50
nM
koff
s-1
kon
M-1s-1
pHTemp
°C
Dipeptidyl peptidase 4
(Homo sapiens (Human))
BDBM11124
((2S)-1-[(2S)-2-amino-3-[4-(furan-2-yl)phenyl]propa...)
Show SMILES N[C@@H](Cc1ccc(cc1)-c1ccco1)C(=O)N1CCC[C@H]1C#N |r|
Show InChI InChI=1S/C18H19N3O2/c19-12-15-3-1-9-21(15)18(22)16(20)11-13-5-7-14(8-6-13)17-4-2-10-23-17/h2,4-8,10,15-16H,1,3,9,11,20H2/t15-,16-/m0/s1
Reactome pathway
36 -10.1n/an/an/an/an/a7.425
Johnson & Johnson Pharmaceutical
Assay Description
The progress of DPPIV inhibition by compounds was measured by recording the liberation of free pNA at 405 nm. IC50 was determined from the slope of r...
Bioorg Med Chem Lett 16: 123-8 (2006)
Article DOI: 10.1016/j.bmcl.2005.09.037
BindingDB Entry DOI: 10.7270/Q2S180QJ