BDBM111316 US8614253, 43-76::US9241942, 27-76
SMILES: COC(=O)c1cccc(c1)-c1ccc(O)c(C=O)c1
InChI Key: InChIKey=JOXYLTMFNHZLNN-UHFFFAOYSA-N
Data: 2 IC50  1 EC50
Activity Spreadsheet -- Enzyme Inhibition Constant Data from BindingDB
Found 3 hits for monomerid = 111316
Trg + Lig
Ki
nM
ΔG°
kcal/mole
IC50
nM
Kd
nM
EC50/IC50
nM
koff
s-1
kon
M-1s-1
pHTemp
°C
Serine/threonine-protein kinase/endoribonuclease IRE1 Alpha
(Homo sapiens (Human))
BDBM111316
(US8614253, 43-76 | US9241942, 27-76)
Show SMILES COC(=O)c1cccc(c1)-c1ccc(O)c(C=O)c1
Show InChI InChI=1S/C15H12O4/c1-19-15(18)12-4-2-3-10(7-12)11-5-6-14(17)13(8-11)9-16/h2-9,17H,1H3
Reactome pathway
US Patent
n/an/a 421n/an/an/an/a7.530
MannKind Corporation
US Patent
Assay Description
IRE-1 alpha, T1 RNase, and RNase A assays carried out in vitro with several o-vanillin derivatives to demonstrate selectivity of the derivatives for ...
US Patent US8614253 (2013)
BindingDB Entry DOI: 10.7270/Q2RF5SQR
Serine/threonine-protein kinase/endoribonuclease IRE1 Alpha
(Homo sapiens (Human))
BDBM111316
(US8614253, 43-76 | US9241942, 27-76)
Show SMILES COC(=O)c1cccc(c1)-c1ccc(O)c(C=O)c1
Show InChI InChI=1S/C15H12O4/c1-19-15(18)12-4-2-3-10(7-12)11-5-6-14(17)13(8-11)9-16/h2-9,17H,1H3
Reactome pathway
US Patent
n/an/an/an/a 3.00E+3n/an/an/an/a
MannKind Corporation
US Patent
Assay Description
Initial cell-based XBP-1 mRNA splicing assays confirmed IRE-1α inhibition with several potent 5-bromo and 6 bromo o-vanillins. HEK293 cells were...
US Patent US9241942 (2016)
BindingDB Entry DOI: 10.7270/Q25B0192
Serine/threonine-protein kinase/endoribonuclease IRE1 Alpha
(Homo sapiens (Human))
BDBM111316
(US8614253, 43-76 | US9241942, 27-76)
Show SMILES COC(=O)c1cccc(c1)-c1ccc(O)c(C=O)c1
Show InChI InChI=1S/C15H12O4/c1-19-15(18)12-4-2-3-10(7-12)11-5-6-14(17)13(8-11)9-16/h2-9,17H,1H3
Reactome pathway
US Patent
n/an/a 421n/an/an/an/a7.5n/a
MannKind Corporation
US Patent
Assay Description
A fusion protein comprising glutathione S transferase (GST) and human IRE-1α (GST-IRE-1α) was obtained from a 500 ml baculovirus-infected i...
US Patent US9241942 (2016)
BindingDB Entry DOI: 10.7270/Q25B0192