null
SMILES: Oc1ccc2cc(ccc2c1C=O)-c1cncnc1
InChI Key: InChIKey=JWLRUVAQLRDEOV-UHFFFAOYSA-N
Activity Spreadsheet -- Enzyme Inhibition Constant Data from BindingDB
Found 3 hits for monomerid = 111343
Trg + Lig
Ki
nM
ΔG°
kcal/mole
IC50
nM
Kd
nM
EC50/IC50
nM
koff
s-1
kon
M-1s-1
pHTemp
°C
Serine/threonine-protein kinase/endoribonuclease IRE1
(Homo sapiens (Human))
BDBM111343
(US8614253, 29-3 | US9241942, 29-3)
Show SMILES Oc1ccc2cc(ccc2c1C=O)-c1cncnc1
Show InChI InChI=1S/C15H10N2O2/c18-8-14-13-3-1-10(12-6-16-9-17-7-12)5-11(13)2-4-15(14)19/h1-9,19H
Reactome pathway
US Patent
n/an/a 66n/an/an/an/a7.530
MannKind Corporation
US Patent
Assay Description
IRE-1 alpha, T1 RNase, and RNase A assays carried out in vitro with several o-vanillin derivatives to demonstrate selectivity of the derivatives for ...
US Patent US8614253 (2013)
BindingDB Entry DOI: 10.7270/Q2RF5SQR
Serine/threonine-protein kinase/endoribonuclease IRE1
(Homo sapiens (Human))
BDBM111343
(US8614253, 29-3 | US9241942, 29-3)
Show SMILES Oc1ccc2cc(ccc2c1C=O)-c1cncnc1
Show InChI InChI=1S/C15H10N2O2/c18-8-14-13-3-1-10(12-6-16-9-17-7-12)5-11(13)2-4-15(14)19/h1-9,19H
Reactome pathway
US Patent
n/an/an/an/a 4.00E+3n/an/an/an/a
MannKind Corporation
US Patent
Assay Description
Initial cell-based XBP-1 mRNA splicing assays confirmed IRE-1α inhibition with several potent 5-bromo and 6 bromo o-vanillins. HEK293 cells were...
US Patent US9241942 (2016)
BindingDB Entry DOI: 10.7270/Q25B0192
Serine/threonine-protein kinase/endoribonuclease IRE1
(Homo sapiens (Human))
BDBM111343
(US8614253, 29-3 | US9241942, 29-3)
Show SMILES Oc1ccc2cc(ccc2c1C=O)-c1cncnc1
Show InChI InChI=1S/C15H10N2O2/c18-8-14-13-3-1-10(12-6-16-9-17-7-12)5-11(13)2-4-15(14)19/h1-9,19H
Reactome pathway
US Patent
n/an/a 66n/an/an/an/a7.5n/a
MannKind Corporation
US Patent
Assay Description
A fusion protein comprising glutathione S transferase (GST) and human IRE-1α (GST-IRE-1α) was obtained from a 500 ml baculovirus-infected i...
US Patent US9241942 (2016)
BindingDB Entry DOI: 10.7270/Q25B0192