BDBM111344 US8614253, 29-4::US9241942, 29-4
SMILES: Oc1ccc2cc(ccc2c1C=O)-c1cccc(c1)C(=O)N1CCOCC1
InChI Key: InChIKey=JZBFVMLLUPAFDP-UHFFFAOYSA-N
Data: 2 IC50  1 EC50
Activity Spreadsheet -- Enzyme Inhibition Constant Data from BindingDB
Found 3 hits for monomerid = 111344
Trg + Lig
Ki
nM
ΔG°
kcal/mole
IC50
nM
Kd
nM
EC50/IC50
nM
koff
s-1
kon
M-1s-1
pHTemp
°C
Serine/threonine-protein kinase/endoribonuclease IRE1 Alpha
(Homo sapiens (Human))
BDBM111344
(US8614253, 29-4 | US9241942, 29-4)
Show SMILES Oc1ccc2cc(ccc2c1C=O)-c1cccc(c1)C(=O)N1CCOCC1
Show InChI InChI=1S/C22H19NO4/c24-14-20-19-6-4-16(12-17(19)5-7-21(20)25)15-2-1-3-18(13-15)22(26)23-8-10-27-11-9-23/h1-7,12-14,25H,8-11H2
Reactome pathway
US Patent
n/an/a 74n/an/an/an/a7.530
MannKind Corporation
US Patent
Assay Description
IRE-1 alpha, T1 RNase, and RNase A assays carried out in vitro with several o-vanillin derivatives to demonstrate selectivity of the derivatives for ...
US Patent US8614253 (2013)
BindingDB Entry DOI: 10.7270/Q2RF5SQR
Serine/threonine-protein kinase/endoribonuclease IRE1 Alpha
(Homo sapiens (Human))
BDBM111344
(US8614253, 29-4 | US9241942, 29-4)
Show SMILES Oc1ccc2cc(ccc2c1C=O)-c1cccc(c1)C(=O)N1CCOCC1
Show InChI InChI=1S/C22H19NO4/c24-14-20-19-6-4-16(12-17(19)5-7-21(20)25)15-2-1-3-18(13-15)22(26)23-8-10-27-11-9-23/h1-7,12-14,25H,8-11H2
Reactome pathway
US Patent
n/an/an/an/a 5.00E+3n/an/an/an/a
MannKind Corporation
US Patent
Assay Description
Initial cell-based XBP-1 mRNA splicing assays confirmed IRE-1α inhibition with several potent 5-bromo and 6 bromo o-vanillins. HEK293 cells were...
US Patent US9241942 (2016)
BindingDB Entry DOI: 10.7270/Q25B0192
Serine/threonine-protein kinase/endoribonuclease IRE1 Alpha
(Homo sapiens (Human))
BDBM111344
(US8614253, 29-4 | US9241942, 29-4)
Show SMILES Oc1ccc2cc(ccc2c1C=O)-c1cccc(c1)C(=O)N1CCOCC1
Show InChI InChI=1S/C22H19NO4/c24-14-20-19-6-4-16(12-17(19)5-7-21(20)25)15-2-1-3-18(13-15)22(26)23-8-10-27-11-9-23/h1-7,12-14,25H,8-11H2
Reactome pathway
US Patent
n/an/a 74n/an/an/an/a7.5n/a
MannKind Corporation
US Patent
Assay Description
A fusion protein comprising glutathione S transferase (GST) and human IRE-1α (GST-IRE-1α) was obtained from a 500 ml baculovirus-infected i...
US Patent US9241942 (2016)
BindingDB Entry DOI: 10.7270/Q25B0192