null
SMILES: Oc1ccc2ncccc2c1C=O
InChI Key: InChIKey=TUVJXIJXRIXXMI-UHFFFAOYSA-N
Activity Spreadsheet -- Enzyme Inhibition Constant Data from BindingDB
Found 3 hits for monomerid = 111382
Trg + Lig
Ki
nM
ΔG°
kcal/mole
IC50
nM
Kd
nM
EC50/IC50
nM
koff
s-1
kon
M-1s-1
pHTemp
°C
Serine/threonine-protein kinase/endoribonuclease IRE1
(Homo sapiens (Human))
BDBM111382
(US8614253, 34-1 | US9241942, 34-1)
Show SMILES Oc1ccc2ncccc2c1C=O
Show InChI InChI=1S/C10H7NO2/c12-6-8-7-2-1-5-11-9(7)3-4-10(8)13/h1-6,13H
Reactome pathway
US Patent
n/an/a 170n/an/an/an/a7.530
MannKind Corporation
US Patent
Assay Description
IRE-1 alpha, T1 RNase, and RNase A assays carried out in vitro with several o-vanillin derivatives to demonstrate selectivity of the derivatives for ...
US Patent US8614253 (2013)
BindingDB Entry DOI: 10.7270/Q2RF5SQR
Serine/threonine-protein kinase/endoribonuclease IRE1
(Homo sapiens (Human))
BDBM111382
(US8614253, 34-1 | US9241942, 34-1)
Show SMILES Oc1ccc2ncccc2c1C=O
Show InChI InChI=1S/C10H7NO2/c12-6-8-7-2-1-5-11-9(7)3-4-10(8)13/h1-6,13H
Reactome pathway
US Patent
n/an/an/an/a 7.00E+3n/an/an/an/a
MannKind Corporation
US Patent
Assay Description
Initial cell-based XBP-1 mRNA splicing assays confirmed IRE-1α inhibition with several potent 5-bromo and 6 bromo o-vanillins. HEK293 cells were...
US Patent US9241942 (2016)
BindingDB Entry DOI: 10.7270/Q25B0192
Serine/threonine-protein kinase/endoribonuclease IRE1
(Homo sapiens (Human))
BDBM111382
(US8614253, 34-1 | US9241942, 34-1)
Show SMILES Oc1ccc2ncccc2c1C=O
Show InChI InChI=1S/C10H7NO2/c12-6-8-7-2-1-5-11-9(7)3-4-10(8)13/h1-6,13H
Reactome pathway
US Patent
n/an/a 170n/an/an/an/a7.5n/a
MannKind Corporation
US Patent
Assay Description
A fusion protein comprising glutathione S transferase (GST) and human IRE-1α (GST-IRE-1α) was obtained from a 500 ml baculovirus-infected i...
US Patent US9241942 (2016)
BindingDB Entry DOI: 10.7270/Q25B0192