BDBM11147 (1S,2S)-1-(dimethylcarbamoyl)-3-[(3S)-3-fluoropyrrolidin-1-yl]-1-(4-{imidazo[1,2-a]pyridazin-6-yl}phenyl)-3-oxopropan-2-aminium; 2,2,2-trifluoroacetate::(2S,3S)-4-(dimethylamino)-1-[(3S)-3-fluoropyrrolidin-1-yl]-3-(4-imidazo[1,2-b]pyridazin-6-ylphenyl)-1,4-dioxobutan-2-aminium trifluoroacetate::Biarylphenylalanine (S)-Fluoropyrrolidide Amide 26
SMILES: CN(C)C(=O)[C@H]([C@H]([NH3+])C(=O)N1CC[C@H](F)C1)c1ccc(cc1)-c1ccc2nccn2n1
InChI Key: InChIKey=FOLTWCJIDGMQPN-VDGAXYAQSA-O
Data: 4 IC50
Activity Spreadsheet -- Enzyme Inhibition Constant Data from BindingDB
Found 4 hits for monomerid = 11147
Trg + Lig
Ki
nM
ΔG°
kcal/mole
IC50
nM
Kd
nM
EC50/IC50
nM
koff
s-1
kon
M-1s-1
pHTemp
°C
Dipeptidyl peptidase 4
(Homo sapiens (Human))
BDBM11147
((1S,2S)-1-(dimethylcarbamoyl)-3-[(3S)-3-fluoropyrr...)
Show SMILES CN(C)C(=O)[C@H]([C@H]([NH3+])C(=O)N1CC[C@H](F)C1)c1ccc(cc1)-c1ccc2nccn2n1 |r|
Show InChI InChI=1S/C22H25FN6O2/c1-27(2)21(30)19(20(24)22(31)28-11-9-16(23)13-28)15-5-3-14(4-6-15)17-7-8-18-25-10-12-29(18)26-17/h3-8,10,12,16,19-20H,9,11,13,24H2,1-2H3/p+1/t16-,19-,20-/m0/s1
Reactome pathway
n/an/a 13n/an/an/an/a7.537
Merck Research Laboratories
Assay Description
The enzyme activity resulted in the formation of the fluorescent product amidomethylcoumarin (AMC), which was monitored by excitation at 360 nm and m...
J Med Chem 49: 3614-27 (2006)
Article DOI: 10.1021/jm060015t
BindingDB Entry DOI: 10.7270/Q2N87807
Dipeptidyl peptidase 9
(Homo sapiens (Human))
BDBM11147
((1S,2S)-1-(dimethylcarbamoyl)-3-[(3S)-3-fluoropyrr...)
Show SMILES CN(C)C(=O)[C@H]([C@H]([NH3+])C(=O)N1CC[C@H](F)C1)c1ccc(cc1)-c1ccc2nccn2n1 |r|
Show InChI InChI=1S/C22H25FN6O2/c1-27(2)21(30)19(20(24)22(31)28-11-9-16(23)13-28)15-5-3-14(4-6-15)17-7-8-18-25-10-12-29(18)26-17/h3-8,10,12,16,19-20H,9,11,13,24H2,1-2H3/p+1/t16-,19-,20-/m0/s1
n/an/a>1.00E+5n/an/an/an/an/an/a
Merck Research Laboratories
Assay Description
The enzyme activity resulted in the formation of the fluorescent product amidomethylcoumarin (AMC), which was monitored by excitation at 360 nm and m...
J Med Chem 49: 3614-27 (2006)
Article DOI: 10.1021/jm060015t
BindingDB Entry DOI: 10.7270/Q2N87807
Dipeptidyl peptidase VIII
(Homo sapiens (Human))
BDBM11147
((1S,2S)-1-(dimethylcarbamoyl)-3-[(3S)-3-fluoropyrr...)
Show SMILES CN(C)C(=O)[C@H]([C@H]([NH3+])C(=O)N1CC[C@H](F)C1)c1ccc(cc1)-c1ccc2nccn2n1 |r|
Show InChI InChI=1S/C22H25FN6O2/c1-27(2)21(30)19(20(24)22(31)28-11-9-16(23)13-28)15-5-3-14(4-6-15)17-7-8-18-25-10-12-29(18)26-17/h3-8,10,12,16,19-20H,9,11,13,24H2,1-2H3/p+1/t16-,19-,20-/m0/s1
n/an/a>1.00E+5n/an/an/an/an/an/a
Merck Research Laboratories
Assay Description
The enzyme activity resulted in the formation of the fluorescent product amidomethylcoumarin (AMC), which was monitored by excitation at 360 nm and m...
J Med Chem 49: 3614-27 (2006)
Article DOI: 10.1021/jm060015t
BindingDB Entry DOI: 10.7270/Q2N87807
Dipeptidyl peptidase 2 (DPP II)
(Homo sapiens (Human))
BDBM11147
((1S,2S)-1-(dimethylcarbamoyl)-3-[(3S)-3-fluoropyrr...)
Show SMILES CN(C)C(=O)[C@H]([C@H]([NH3+])C(=O)N1CC[C@H](F)C1)c1ccc(cc1)-c1ccc2nccn2n1 |r|
Show InChI InChI=1S/C22H25FN6O2/c1-27(2)21(30)19(20(24)22(31)28-11-9-16(23)13-28)15-5-3-14(4-6-15)17-7-8-18-25-10-12-29(18)26-17/h3-8,10,12,16,19-20H,9,11,13,24H2,1-2H3/p+1/t16-,19-,20-/m0/s1
n/an/a>1.00E+5n/an/an/an/an/an/a
Merck Research Laboratories
Assay Description
The enzyme activity resulted in the formation of the fluorescent product amidomethylcoumarin (AMC), which was monitored by excitation at 360 nm and m...
J Med Chem 49: 3614-27 (2006)
Article DOI: 10.1021/jm060015t
BindingDB Entry DOI: 10.7270/Q2N87807