BDBM111490 US8618286, 16
SMILES: NC(=Nc1ccc2N(CCNCCO)CCSc2c1)c1cccs1
InChI Key: InChIKey=SABGANXHPJUUAK-UHFFFAOYSA-N
Data: 3 IC50
Activity Spreadsheet -- Enzyme Inhibition Constant Data from BindingDB
Found 3 hits for monomerid = 111490
Trg + Lig
Ki
nM
ΔG°
kcal/mole
IC50
nM
Kd
nM
EC50/IC50
nM
koff
s-1
kon
M-1s-1
pHTemp
°C
Nitric oxide synthase, brain
(Homo sapiens (Human))
BDBM111490
(US8618286, 16)
Show SMILES NC(=Nc1ccc2N(CCNCCO)CCSc2c1)c1cccs1 |w:2.2|
Show InChI InChI=1S/C17H22N4OS2/c18-17(15-2-1-10-23-15)20-13-3-4-14-16(12-13)24-11-8-21(14)7-5-19-6-9-22/h1-4,10,12,19,22H,5-9,11H2,(H2,18,20)
Reactome pathway
US Patent
n/an/a 34n/an/an/an/an/an/a
NeurAxon, Inc.
US Patent
Assay Description
Primary stock solutions of test compounds at a concentration of 6 mM were prepared from the 2 to 5 mg powder. The primary stock solutions of each tes...
US Patent US8618286 (2013)
BindingDB Entry DOI: 10.7270/Q2C53JH7
Nitric oxide synthase, inducible
(Homo sapiens (Human))
BDBM111490
(US8618286, 16)
Show SMILES NC(=Nc1ccc2N(CCNCCO)CCSc2c1)c1cccs1 |w:2.2|
Show InChI InChI=1S/C17H22N4OS2/c18-17(15-2-1-10-23-15)20-13-3-4-14-16(12-13)24-11-8-21(14)7-5-19-6-9-22/h1-4,10,12,19,22H,5-9,11H2,(H2,18,20)
NCI pathway
Reactome pathway
US Patent
n/an/a 5.87E+4n/an/an/an/an/an/a
NeurAxon, Inc.
US Patent
Assay Description
Recombinant human inducible NOS (iNOS) was produced in Baculovirus-infected Sf9 cells (ALEXIS). In a radiometric method, NO synthase activity was det...
US Patent US8618286 (2013)
BindingDB Entry DOI: 10.7270/Q2C53JH7
Nitric oxide synthase, endothelial
(Homo sapiens (Human))
BDBM111490
(US8618286, 16)
Show SMILES NC(=Nc1ccc2N(CCNCCO)CCSc2c1)c1cccs1 |w:2.2|
Show InChI InChI=1S/C17H22N4OS2/c18-17(15-2-1-10-23-15)20-13-3-4-14-16(12-13)24-11-8-21(14)7-5-19-6-9-22/h1-4,10,12,19,22H,5-9,11H2,(H2,18,20)
US Patent
n/an/a 7.00E+3n/an/an/an/an/an/a
NeurAxon, Inc.
US Patent
Assay Description
Primary stock solutions of test compounds at a concentration of 6 mM were prepared from the 2 to 5 mg powder. The primary stock solutions of each tes...
US Patent US8618286 (2013)
BindingDB Entry DOI: 10.7270/Q2C53JH7