BDBM11151 (1S,2S)-1-(dimethylcarbamoyl)-3-(3-fluoroazetidin-1-yl)-3-oxo-1-(4-{[1,2,4]triazolo[1,5-a]pyridin-6-yl}phenyl)propan-2-aminium; 2,2,2-trifluoroacetate::(2S,3S)-4-(dimethylamino)-1-(3-fluoroazetidin-1-yl)-1,4-dioxo-3-(4-[1,2,4]triazolo[1,5-a]pyridin-6-ylphenyl)butan-2-aminium trifluoroacetate::Biarylphenylalanine Amide 30
SMILES: CN(C)C(=O)[C@H]([C@H]([NH3+])C(=O)N1CC(F)C1)c1ccc(cc1)-c1ccc2ncnn2c1
InChI Key: InChIKey=XRPGGQPAPGZUPK-OALUTQOASA-O
Data: 4 IC50
PDB links: 1 PDB ID contains inhibitors having a similarity of 90% to this monomer.
Activity Spreadsheet -- Enzyme Inhibition Constant Data from BindingDB
Found 4 hits for monomerid = 11151
Trg + Lig
Ki
nM
ΔG°
kcal/mole
IC50
nM
Kd
nM
EC50/IC50
nM
koff
s-1
kon
M-1s-1
pHTemp
°C
Dipeptidyl peptidase 4
(Homo sapiens (Human))
BDBM11151
((1S,2S)-1-(dimethylcarbamoyl)-3-(3-fluoroazetidin-...)
Show SMILES CN(C)C(=O)[C@H]([C@H]([NH3+])C(=O)N1CC(F)C1)c1ccc(cc1)-c1ccc2ncnn2c1 |r|
Show InChI InChI=1S/C21H23FN6O2/c1-26(2)20(29)18(19(23)21(30)27-10-16(22)11-27)14-5-3-13(4-6-14)15-7-8-17-24-12-25-28(17)9-15/h3-9,12,16,18-19H,10-11,23H2,1-2H3/p+1/t18-,19-/m0/s1
Reactome pathway
n/an/a 2.70n/an/an/an/a7.537
Merck Research Laboratories
Assay Description
The enzyme activity resulted in the formation of the fluorescent product amidomethylcoumarin (AMC), which was monitored by excitation at 360 nm and m...
J Med Chem 49: 3614-27 (2006)
Article DOI: 10.1021/jm060015t
BindingDB Entry DOI: 10.7270/Q2N87807
Dipeptidyl peptidase 9
(Homo sapiens (Human))
BDBM11151
((1S,2S)-1-(dimethylcarbamoyl)-3-(3-fluoroazetidin-...)
Show SMILES CN(C)C(=O)[C@H]([C@H]([NH3+])C(=O)N1CC(F)C1)c1ccc(cc1)-c1ccc2ncnn2c1 |r|
Show InChI InChI=1S/C21H23FN6O2/c1-26(2)20(29)18(19(23)21(30)27-10-16(22)11-27)14-5-3-13(4-6-14)15-7-8-17-24-12-25-28(17)9-15/h3-9,12,16,18-19H,10-11,23H2,1-2H3/p+1/t18-,19-/m0/s1
n/an/a>1.00E+5n/an/an/an/an/an/a
Merck Research Laboratories
Assay Description
The enzyme activity resulted in the formation of the fluorescent product amidomethylcoumarin (AMC), which was monitored by excitation at 360 nm and m...
J Med Chem 49: 3614-27 (2006)
Article DOI: 10.1021/jm060015t
BindingDB Entry DOI: 10.7270/Q2N87807
Dipeptidyl peptidase VIII
(Homo sapiens (Human))
BDBM11151
((1S,2S)-1-(dimethylcarbamoyl)-3-(3-fluoroazetidin-...)
Show SMILES CN(C)C(=O)[C@H]([C@H]([NH3+])C(=O)N1CC(F)C1)c1ccc(cc1)-c1ccc2ncnn2c1 |r|
Show InChI InChI=1S/C21H23FN6O2/c1-26(2)20(29)18(19(23)21(30)27-10-16(22)11-27)14-5-3-13(4-6-14)15-7-8-17-24-12-25-28(17)9-15/h3-9,12,16,18-19H,10-11,23H2,1-2H3/p+1/t18-,19-/m0/s1
n/an/a>1.00E+5n/an/an/an/an/an/a
Merck Research Laboratories
Assay Description
The enzyme activity resulted in the formation of the fluorescent product amidomethylcoumarin (AMC), which was monitored by excitation at 360 nm and m...
J Med Chem 49: 3614-27 (2006)
Article DOI: 10.1021/jm060015t
BindingDB Entry DOI: 10.7270/Q2N87807
Dipeptidyl peptidase 2 (DPP II)
(Homo sapiens (Human))
BDBM11151
((1S,2S)-1-(dimethylcarbamoyl)-3-(3-fluoroazetidin-...)
Show SMILES CN(C)C(=O)[C@H]([C@H]([NH3+])C(=O)N1CC(F)C1)c1ccc(cc1)-c1ccc2ncnn2c1 |r|
Show InChI InChI=1S/C21H23FN6O2/c1-26(2)20(29)18(19(23)21(30)27-10-16(22)11-27)14-5-3-13(4-6-14)15-7-8-17-24-12-25-28(17)9-15/h3-9,12,16,18-19H,10-11,23H2,1-2H3/p+1/t18-,19-/m0/s1
n/an/a>1.00E+5n/an/an/an/an/an/a
Merck Research Laboratories
Assay Description
The enzyme activity resulted in the formation of the fluorescent product amidomethylcoumarin (AMC), which was monitored by excitation at 360 nm and m...
J Med Chem 49: 3614-27 (2006)
Article DOI: 10.1021/jm060015t
BindingDB Entry DOI: 10.7270/Q2N87807